{"text_format":"3","workbook":"xlsx","n_sheets":15,"sheets":["Welcome","Company_Information","Lists","Regulated_Operation_Limits","Deviation_Limits","Description_of_Changes","Certification","HAP_ID","CMS_Info","Summary_Report_Limit","Summary_Report_CPMS","CMS_Detail","Limits_Detail","Revisions","Worksheet Map"],"not_rendered":{"images":1,"macros":1,"defined_names":5},"read":"whole","date_system":"1900"}

{"sheet":"Welcome","index":0,"n_rows":16,"n_cols":2,"rows_kept":16}
["DO NOT REMOVE OR EDIT INFORMATION IN ROWS 1 THROUGH 5\nFOR INTERNAL USE ONLY"]
["Template Name","63.5765(d) Semiannual Compliance Report (Spreadsheet Template)"]
["CitationID","63.5765(d)"]
["Template Version","ICR Draft"]
["Last Updated Date",{"v":45601,"d":"4560100.00%"}]
["Blank","OMB No.: 2060-0546 Form 5900-717"]
[null,"For further Paperwork Reduction Act information see: \nhttps://www.epa.gov/electronic-reporting-air-emissions/paperwork-reduction-act-pra-cedri-and-ert"]
["Blank","40 CFR Part 63, Subpart VVVV National Emission Standards for Hazardous Air Pollutants: Boat Manufacturing - §63.5765(d) Semiannual Compliance Report "]
[null,"Instructions for Spreadsheet Template\n\nPurpose:\nThis spreadsheet template was designed by the U.S. EPA to facilitate Semiannual Compliance reporting for facilities subject under the 40 CFR part 63, subpart VVVV National Emission Standard for Hazardous Air Pollutants: Boat Manufacturing.  \n"]
[null,"Electronic reporting:\nElectronic submission of Semiannual Compliance Reports through the EPA's Compliance and Emissions Data Reporting Interface (CEDRI) is required under §63.5765(g). CEDRI is accessed through the EPA's Central Data Exchange (https://cdx.epa.gov).\n"]
{"$rows_left_out":7}
{"sheet":"Company_Information","index":1,"n_rows":33,"n_cols":15,"rows_kept":33}
[null,"DO NOT REMOVE OR EDIT INFORMATION IN ROWS 1 THROUGH 5\nFOR INTERNAL USE ONLY"]
[null,"Template Name",{"$f":"+Welcome!B2","v":"63.5765(d) Semiannual Compliance Report (Spreadsheet Template)"}]
[null,"CitationID",{"$f":"+Welcome!B3","v":"63.5765(d)"}]
[null,"Template Version",{"$f":"+Welcome!B4","v":"ICR Draft"}]
[null,"Last Updated Date",{"$f":"+Welcome!B5","v":{"v":45601,"d":"4560100.00%"}}]
[]
[null,"40 CFR Part 63, Subpart VVVV National Emission Standards for Hazardous Air Pollutants: Boat Manufacturing - §63.5765(d)  Semiannual Compliance Report Spreadsheet Template"]
[null,"\n"]
[]
[]
{"$rows_left_out":24}
{"sheet":"Lists","index":2,"n_rows":500,"n_cols":19,"rows_kept":500,"hidden":true}
["Num","Units","Unitlist",null,"ApplicationMethods",null,"Num","Company","Companylist",null,"CMSCauseslist",null,"Num","CEM Name","CEMID",null,"Operating Limits",null,"States"]
[{"$f":"+IF(B2=\"\",\"\",MAX(A1:A$1)+1)","v":""},{"$f":"IF(+Regulated_Operation_Limits!C24=\"\",\"\",IF(COUNTIF(Regulated_Operation_Limits!$C24:$C$100,Regulated_Operation_Limits!C24)=1,Regulated_Operation_Limits!C24,\"\"))","v":""},{"$f":"+IFERROR(INDEX($B$2:$B$501,MATCH(ROW()-ROW($C$1),$A$2:$A$501,0)),\"\")","v":""},null,"Atomized (Spray)",null,{"$f":"+IF(H2=\"\",\"\",MAX(G1:G$1)+1)","v":""},{"$f":"IF(Company_Information!C24=\"\",\"\",Company_Information!B24)","v":""},{"$f":"+IFERROR(INDEX($H$2:$H$11,MATCH(ROW()-ROW($I$1),$G$2:$G$11,0)),\"\")","v":""},null,"Monitoring Equipment Malfunctions",null,{"$f":"+IF(N2=\"\",\"\",MAX(M1:M$1)+1)","v":""},{"$f":"+IF(+CMS_Info!D24=\"\",\"\",IF(COUNTIF(CMS_Info!$D24:$D$500,CMS_Info!D24)=1,CMS_Info!D24,\"\"))","v":""},{"$f":"+IFERROR(INDEX($N$2:$N$501,MATCH(ROW()-ROW($O$1),$M$2:$M$501,0)),\"\")","v":""},null,"Organic HAP Emissions",null,"AK"]
[{"$f":"+IF(B3=\"\",\"\",MAX(A$1:A2)+1)","v":""},{"$f":"IF(+Regulated_Operation_Limits!C25=\"\",\"\",IF(COUNTIF(Regulated_Operation_Limits!$C25:$C$100,Regulated_Operation_Limits!C25)=1,Regulated_Operation_Limits!C25,\"\"))","v":""},{"$f":"+IFERROR(INDEX($B$2:$B$501,MATCH(ROW()-ROW($C$1),$A$2:$A$501,0)),\"\")","v":""},null,"Atomized, plus vacuum bagging with roll-out",null,{"$f":"+IF(H3=\"\",\"\",MAX(G$1:G2)+1)","v":""},{"$f":"IF(Company_Information!C25=\"\",\"\",Company_Information!B25)","v":""},"",null,"Nonmonitoring Equipment Malfunctions",null,{"$f":"+IF(N3=\"\",\"\",MAX(M$1:M2)+1)","v":""},{"$f":"+IF(+CMS_Info!D25=\"\",\"\",IF(COUNTIF(CMS_Info!$D25:$D$500,CMS_Info!D25)=1,CMS_Info!D25,\"\"))","v":""},{"$f":"+IFERROR(INDEX($N$2:$N$501,MATCH(ROW()-ROW($O$1),$M$2:$M$501,0)),\"\")","v":""},null,"Average Combustion Temperature",null,"AL"]
[{"$f":"+IF(B4=\"\",\"\",MAX(A$1:A3)+1)","v":""},{"$f":"IF(+Regulated_Operation_Limits!C26=\"\",\"\",IF(COUNTIF(Regulated_Operation_Limits!$C26:$C$100,Regulated_Operation_Limits!C26)=1,Regulated_Operation_Limits!C26,\"\"))","v":""},"",null,"Atomized, plus vacuum bagging without roll-out",null,{"$f":"+IF(H4=\"\",\"\",MAX(G$1:G3)+1)","v":""},{"$f":"IF(Company_Information!C26=\"\",\"\",Company_Information!B26)","v":""},"",null,"Quality Assurance/Quality Control Calibrations",null,{"$f":"+IF(N4=\"\",\"\",MAX(M$1:M3)+1)","v":""},{"$f":"+IF(+CMS_Info!D26=\"\",\"\",IF(COUNTIF(CMS_Info!$D26:$D$500,CMS_Info!D26)=1,CMS_Info!D26,\"\"))","v":""},"",null,"Other Approved Operating Limit",null,"AR"]
[{"$f":"+IF(B5=\"\",\"\",MAX(A$1:A4)+1)","v":""},{"$f":"IF(+Regulated_Operation_Limits!C27=\"\",\"\",IF(COUNTIF(Regulated_Operation_Limits!$C27:$C$100,Regulated_Operation_Limits!C27)=1,Regulated_Operation_Limits!C27,\"\"))","v":""},"",null,"Nonatomized (Nonspray)",null,{"$f":"+IF(H5=\"\",\"\",MAX(G$1:G4)+1)","v":""},{"$f":"IF(Company_Information!C27=\"\",\"\",Company_Information!B27)","v":""},"",null,"Other Known Causes",null,{"$f":"+IF(N5=\"\",\"\",MAX(M$1:M4)+1)","v":""},{"$f":"+IF(+CMS_Info!D27=\"\",\"\",IF(COUNTIF(CMS_Info!$D27:$D$500,CMS_Info!D27)=1,CMS_Info!D27,\"\"))","v":""},"",null,"PTE Air Flow Direction",null,"AS"]
[{"$f":"+IF(B6=\"\",\"\",MAX(A$1:A5)+1)","v":""},{"$f":"IF(+Regulated_Operation_Limits!C28=\"\",\"\",IF(COUNTIF(Regulated_Operation_Limits!$C28:$C$100,Regulated_Operation_Limits!C28)=1,Regulated_Operation_Limits!C28,\"\"))","v":""},"",null,"Nonatomized , plus vacuum bagging with roll-out",null,{"$f":"+IF(H6=\"\",\"\",MAX(G$1:G5)+1)","v":""},{"$f":"IF(Company_Information!C28=\"\",\"\",Company_Information!B28)","v":""},"",null,"Other Unknown Causes",null,{"$f":"+IF(N6=\"\",\"\",MAX(M$1:M5)+1)","v":""},{"$f":"+IF(+CMS_Info!D28=\"\",\"\",IF(COUNTIF(CMS_Info!$D28:$D$500,CMS_Info!D28)=1,CMS_Info!D28,\"\"))","v":""},"",null,"PTE Facial Velocity",null,"AZ"]
[{"$f":"+IF(B7=\"\",\"\",MAX(A$1:A6)+1)","v":""},{"$f":"IF(+Regulated_Operation_Limits!C29=\"\",\"\",IF(COUNTIF(Regulated_Operation_Limits!$C29:$C$100,Regulated_Operation_Limits!C29)=1,Regulated_Operation_Limits!C29,\"\"))","v":""},"",null,"Nonatomized, plus vacuum bagging without roll-out",null,{"$f":"+IF(H7=\"\",\"\",MAX(G$1:G6)+1)","v":""},{"$f":"IF(Company_Information!C29=\"\",\"\",Company_Information!B29)","v":""},"",{"$nulls":3},{"$f":"+IF(N7=\"\",\"\",MAX(M$1:M6)+1)","v":""},{"$f":"+IF(+CMS_Info!D29=\"\",\"\",IF(COUNTIF(CMS_Info!$D29:$D$500,CMS_Info!D29)=1,CMS_Info!D29,\"\"))","v":""},"",null,"PTE Pressure Drop Across Enclosure",null,"CA"]
[{"$f":"+IF(B8=\"\",\"\",MAX(A$1:A7)+1)","v":""},{"$f":"IF(+Regulated_Operation_Limits!C30=\"\",\"\",IF(COUNTIF(Regulated_Operation_Limits!$C30:$C$100,Regulated_Operation_Limits!C30)=1,Regulated_Operation_Limits!C30,\"\"))","v":""},"",null,"Any Method",null,{"$f":"+IF(H8=\"\",\"\",MAX(G$1:G7)+1)","v":""},{"$f":"IF(Company_Information!C30=\"\",\"\",Company_Information!B30)","v":""},"",{"$nulls":3},{"$f":"+IF(N8=\"\",\"\",MAX(M$1:M7)+1)","v":""},{"$f":"+IF(+CMS_Info!D30=\"\",\"\",IF(COUNTIF(CMS_Info!$D30:$D$500,CMS_Info!D30)=1,CMS_Info!D30,\"\"))","v":""},"",null,"Non-PTE gas flow rate",null,"CO"]
[{"$f":"+IF(B9=\"\",\"\",MAX(A$1:A8)+1)","v":""},{"$f":"IF(+Regulated_Operation_Limits!C31=\"\",\"\",IF(COUNTIF(Regulated_Operation_Limits!$C31:$C$100,Regulated_Operation_Limits!C31)=1,Regulated_Operation_Limits!C31,\"\"))","v":""},"",{"$nulls":3},{"$f":"+IF(H9=\"\",\"\",MAX(G$1:G8)+1)","v":""},{"$f":"IF(Company_Information!C31=\"\",\"\",Company_Information!B31)","v":""},"",{"$nulls":3},{"$f":"+IF(N9=\"\",\"\",MAX(M$1:M8)+1)","v":""},{"$f":"+IF(+CMS_Info!D31=\"\",\"\",IF(COUNTIF(CMS_Info!$D31:$D$500,CMS_Info!D31)=1,CMS_Info!D31,\"\"))","v":""},"",null,"Non-PTE Duct Static Pressure",null,"CT"]
[{"$f":"+IF(B10=\"\",\"\",MAX(A$1:A9)+1)","v":""},{"$f":"IF(+Regulated_Operation_Limits!C32=\"\",\"\",IF(COUNTIF(Regulated_Operation_Limits!$C32:$C$100,Regulated_Operation_Limits!C32)=1,Regulated_Operation_Limits!C32,\"\"))","v":""},"",{"$nulls":3},{"$f":"+IF(H10=\"\",\"\",MAX(G$1:G9)+1)","v":""},{"$f":"IF(Company_Information!C32=\"\",\"\",Company_Information!B32)","v":""},"",{"$nulls":3},{"$f":"+IF(N10=\"\",\"\",MAX(M$1:M9)+1)","v":""},{"$f":"+IF(+CMS_Info!D32=\"\",\"\",IF(COUNTIF(CMS_Info!$D32:$D$500,CMS_Info!D32)=1,CMS_Info!D32,\"\"))","v":""},"",null,"Non-PTE Pressure Drop Across Opening",null,"DC"]
{"$rows_left_out":491}
{"sheet":"Regulated_Operation_Limits","index":3,"n_rows":23,"n_cols":10,"rows_kept":23}
[null,"DO NOT REMOVE OR EDIT INFORMATION IN ROWS 1 THROUGH 5\nFOR INTERNAL USE ONLY"]
[null,"Template Name",{"$f":"+Welcome!B2","v":"63.5765(d) Semiannual Compliance Report (Spreadsheet Template)"}]
[null,"CitationID",{"$f":"+Welcome!B3","v":"63.5765(d)"}]
[null,"Template Version",{"$f":"+Welcome!B4","v":"ICR Draft"}]
[null,"Last Updated Date",{"$f":"+Welcome!B5","v":{"v":45601,"d":"4560100.00%"}}]
[]
[null,"40 CFR Part 63, Subpart VVVV National Emission Standards for Hazardous Air Pollutants: Boat Manufacturing - §63.5765(d)  Semiannual Compliance Report Spreadsheet Template"]
[null,"\n"]
[]
[]
{"$rows_left_out":14}
{"sheet":"Deviation_Limits","index":4,"n_rows":23,"n_cols":8,"rows_kept":23}
[null,"DO NOT REMOVE OR EDIT INFORMATION IN ROWS 1 THROUGH 5\nFOR INTERNAL USE ONLY"]
[null,"Template Name",null,{"$f":"+Welcome!B2","v":"63.5765(d) Semiannual Compliance Report (Spreadsheet Template)"}]
[null,"CitationID",null,{"$f":"+Welcome!B3","v":"63.5765(d)"}]
[null,"Template Version",null,{"$f":"+Welcome!B4","v":"ICR Draft"}]
[null,"Last Updated Date",null,{"$f":"+Welcome!B5","v":{"v":45601,"d":"4560100.00%"}}]
[]
[null,"40 CFR Part 63, Subpart VVVV National Emission Standards for Hazardous Air Pollutants: Boat Manufacturing - §63.5765(d)  Semiannual Compliance Report Spreadsheet Template"]
[null,"\n"]
[]
[]
{"$rows_left_out":14}
{"sheet":"Description_of_Changes","index":5,"n_rows":25,"n_cols":4,"rows_kept":25}
[null,"DO NOT REMOVE OR EDIT INFORMATION IN ROWS 1 THROUGH 5\nFOR INTERNAL USE ONLY"]
[null,"Template Name",{"$f":"+Welcome!B2","v":"63.5765(d) Semiannual Compliance Report (Spreadsheet Template)"}]
[null,"CitationID",{"$f":"+Welcome!B3","v":"63.5765(d)"}]
[null,"Template Version",{"$f":"+Welcome!B4","v":"ICR Draft"}]
[null,"Last Updated Date",{"$f":"+Welcome!B5","v":{"v":45601,"d":"4560100.00%"}}]
[null,"Intentionally Blank","Intentionally Blank"]
[null,"40 CFR Part 63, Subpart VVVV National Emission Standards for Hazardous Air Pollutants: Boat Manufacturing - §63.5765(d)  Semiannual Compliance Report Spreadsheet Template"]
[]
[null,"CPMS, CEMS, COMS, Processes, or Control Changes"]
[null,"A description of any changes in the CPMS, CEMS, COMS, processes or controls since the last semiannual reporting period."]
{"$rows_left_out":16}
{"sheet":"Certification","index":6,"n_rows":33,"n_cols":4,"rows_kept":33}
[null,"DO NOT REMOVE OR EDIT INFORMATION IN ROWS 1 THROUGH 5\nFOR INTERNAL USE ONLY"]
[null,"Template Name",{"$f":"+Welcome!B2","v":"63.5765(d) Semiannual Compliance Report (Spreadsheet Template)"}]
[null,"CitationID",{"$f":"+Welcome!B3","v":"63.5765(d)"}]
[null,"Template Version",{"$f":"+Welcome!B4","v":"ICR Draft"}]
[null,"Last Updated Date",{"$f":"+Welcome!B5","v":{"v":45601,"d":"4560100.00%"}}]
[]
[null,"40 CFR Part 63, Subpart VVVV National Emission Standards for Hazardous Air Pollutants: Boat Manufacturing - "]
[null,"§63.5765(d)  Semiannual Compliance Report Spreadsheet Template"]
[null,"Complete this form when you have completed the semiannual compliance report."]
[]
{"$rows_left_out":24}
{"sheet":"HAP_ID","index":7,"n_rows":23,"n_cols":4,"rows_kept":23}
[null,"DO NOT REMOVE OR EDIT INFORMATION IN ROWS 1 THROUGH 5\nFOR INTERNAL USE ONLY"]
[null,"Template Name",null,{"$f":"+Welcome!B2","v":"63.5765(d) Semiannual Compliance Report (Spreadsheet Template)"}]
[null,"CitationID",null,{"$f":"+Welcome!B3","v":"63.5765(d)"}]
[null,"Template Version",null,{"$f":"+Welcome!B4","v":"ICR Draft"}]
[null,"Last Updated Date",null,{"$f":"+Welcome!B5","v":{"v":45601,"d":"4560100.00%"}}]
[]
[null,"40 CFR Part 63, Subpart VVVV National Emission Standards for Hazardous Air Pollutants: Boat Manufacturing - "]
[null,"§63.5765(d)  Semiannual Compliance Report Spreadsheet Template"]
[]
[]
{"$rows_left_out":14}
{"sheet":"CMS_Info","index":8,"n_rows":23,"n_cols":5,"rows_kept":23}
[null,"DO NOT REMOVE OR EDIT INFORMATION IN ROWS 1 THROUGH 5\nFOR INTERNAL USE ONLY"]
[null,"Template Name"]
[null,"CitationID"]
[null,"Template Version"]
[null,"Last Updated Date"]
[]
[null,"40 CFR Part 63, Subpart VVVV National Emission Standards for Hazardous Air Pollutants: Boat Manufacturing - "]
[null,"§63.5765(d) Semiannual Compliance Report Spreadsheet Template"]
[]
[]
{"$rows_left_out":14}
{"sheet":"Summary_Report_Limit","index":9,"n_rows":707,"n_cols":11,"rows_kept":707}
[null,"DO NOT REMOVE OR EDIT INFORMATION IN ROWS 1 THROUGH 5\nFOR INTERNAL USE ONLY"]
[null,"Template Name",null,null,{"$f":"+Welcome!B2","v":"63.5765(d) Semiannual Compliance Report (Spreadsheet Template)"}]
[null,"CitationID",null,null,{"$f":"+Welcome!B3","v":"63.5765(d)"}]
[null,"Template Version",null,null,{"$f":"+Welcome!B4","v":"ICR Draft"}]
[null,"Last Updated Date",null,null,{"$f":"+Welcome!B5","v":{"v":45601,"d":"4560100.00%"}}]
[]
[null,"40 CFR Part 63, Subpart VVVV National Emission Standards for Hazardous Air Pollutants: Boat Manufacturing - §63.5765(d)  Semiannual Compliance Report Spreadsheet Template"]
[null,"\n"]
[]
[]
{"$rows_left_out":698}
{"sheet":"Summary_Report_CPMS","index":10,"n_rows":707,"n_cols":12,"rows_kept":707}
[null,"DO NOT REMOVE OR EDIT INFORMATION IN ROWS 1 THROUGH 5\nFOR INTERNAL USE ONLY"]
[null,"Template Name",null,null,{"$f":"+Welcome!B2","v":"63.5765(d) Semiannual Compliance Report (Spreadsheet Template)"}]
[null,"CitationID",null,null,{"$f":"+Welcome!B3","v":"63.5765(d)"}]
[null,"Template Version",null,null,{"$f":"+Welcome!B4","v":"ICR Draft"}]
[null,"Last Updated Date",null,null,{"$f":"+Welcome!B5","v":{"v":45601,"d":"4560100.00%"}}]
[]
[null,"40 CFR Part 63, Subpart VVVV National Emission Standards for Hazardous Air Pollutants: Boat Manufacturing - §63.5765(d)  Semiannual Compliance Report Spreadsheet Template"]
[null,"\n"]
[]
[]
{"$rows_left_out":698}
{"sheet":"CMS_Detail","index":11,"n_rows":500,"n_cols":12,"rows_kept":500}
[null,"DO NOT REMOVE OR EDIT INFORMATION IN ROWS 1 THROUGH 5\nFOR INTERNAL USE ONLY"]
[null,"Template Name",null,{"$f":"+Welcome!B2","v":"63.5765(d) Semiannual Compliance Report (Spreadsheet Template)"}]
[null,"CitationID",null,{"$f":"+Welcome!B3","v":"63.5765(d)"}]
[null,"Template Version",null,{"$f":"+Welcome!B4","v":"ICR Draft"}]
[null,"Last Updated Date",null,{"$f":"+Welcome!B5","v":{"v":45601,"d":"4560100.00%"}}]
[]
[null,"40 CFR Part 63, Subpart VVVV National Emission Standards for Hazardous Air Pollutants: Boat Manufacturing - §63.5765(d)  Semiannual Compliance Report Spreadsheet Template"]
[null,"\n"]
[]
[]
{"$rows_left_out":491}
{"sheet":"Limits_Detail","index":12,"n_rows":500,"n_cols":11,"rows_kept":500}
[null,"DO NOT REMOVE OR EDIT INFORMATION IN ROWS 1 THROUGH 5\nFOR INTERNAL USE ONLY"]
[null,"Template Name",null,{"$f":"+Welcome!B2","v":"63.5765(d) Semiannual Compliance Report (Spreadsheet Template)"}]
[null,"CitationID",null,{"$f":"+Welcome!B3","v":"63.5765(d)"}]
[null,"Template Version",null,{"$f":"+Welcome!B4","v":"ICR Draft"}]
[null,"Last Updated Date",null,{"$f":"+Welcome!B5","v":{"v":45601,"d":"4560100.00%"}}]
[]
[null,"40 CFR Part 63, Subpart VVVV National Emission Standards for Hazardous Air Pollutants: Boat Manufacturing - §63.5765(d)  Semiannual Compliance Report Spreadsheet Template"]
[null,"\n"]
[]
[]
{"$rows_left_out":491}
{"sheet":"Revisions","index":13,"n_rows":5,"n_cols":3,"rows_kept":5}
["40 CFR Part 63, Subpart VVVV National Emission Standards for Hazardous Air Pollutants: Boat Manufacturing - §63.5765(d)  Semiannual Compliance Report Spreadsheet Template"]
["Revision Number","Date","Revisions"]
[{"v":1,"d":"1.00"},{"v":43969,"d":"4396900.00%"},"Initial Release Version"]
[1.01,{"v":45391,"d":"4539100.00%"},"Updated Welcome tab"]
["ICR Draft","11/5/20224","Add header to Revisions tab; Updated Welcome tab; Remove * and  Required field label throughout; update cell formatting thoughout, add \"e.g.:\" to all blank example cells"]

{"sheet":"Worksheet Map","index":14,"n_rows":12,"n_cols":5,"rows_kept":12,"hidden":true}
["Worksheet Name","Parent","JSON Key","Parent Primary Key","Child Foreign Key"]
["Company_Information",null,"records"]
["Regulated_Operation_Limits","records","RegulatedOperationLimits","RecordId","RecordId"]
["Deviation_Limits","records","DeviationLimits","RecordId","RecordId"]
["Description_of_Changes","records","DescriptionOfChanges","RecordId","RecordId"]
["Certification","records","Certification","RecordId","RecordId"]
["HAP_ID","records","HAPID","RecordId","RecordId"]
["CMS_Info","records","CMSInfo","RecordId","RecordId"]
["Summary_Report_Limit","records","SummaryReportLimit","RecordId","RecordId"]
["Summary_Report_CPMS","records","SummaryReportCPMS","RecordId","RecordId"]
{"$rows_left_out":2}