{"text_format":"3","workbook":"xlsx","n_sheets":5,"sheets":["Introduction","Product","Sheet3","Sheet4","Sheet5"],"not_rendered":{"macros":1,"defined_names":87},"read":"whole","date_system":"1900"}

{"sheet":"Introduction","index":0,"n_rows":24,"n_cols":8,"rows_kept":24,"merged":[[0,0,0,1],[1,0,1,1],[1,2,1,3],[1,7,1,12],[2,0,2,1],[2,2,16,3],[23,0,26,3]]}
["Unique Identifying Information for New Tobacco Products",null,null,"DRAFT FDA FORM 4057b"]
["Instructions:\n1.  First, enter Applicant Name then Product Category and Subcategory as required by 21 CFR § 1114.7(c)(3).   \n2.  Click \"Enter Unique Product Properties\" button then enter applicable product information as specified in Table 1 to 21 CFR § 1114.7(c)(3)(iii) under the Product Tab. \n3.  Verify completion then SAVE AS .XLS or .XLSX and name appropriately.  Must be XLS or XLSX to attach to eSubmitter file for submission. ",null,"Please note:",{"$nulls":4},"OMB Control No. 0910-0879\nExpiration Date: xx/xx/xxxx\nSee PRA Statement on bottom of page"]
["Product Information",null,"\n\nSaving as an .xls or .xlsx will cause all drop down menus to disappear, so be certain you are completely finished.  Your data will be saved, but you will not have drop down functions if you must re-open.  \n\nContinue through the errors and save the file as \"Tobacco_Product_list.xls\" or \"Tobacco_Product_list.xlsx\". If there are multiple product files, save the files as \"Tobacco_Product_list_n.xls\"  or \"Tobacco_Product_list_n.xlsx\"(where n=1,2,3,etc.)\n\nUse \"Additional Property\" to differentiate the products if all the other unique product properties are exactly the same.                                                                                                                                                                                                                                                                                                              If you categorize your product as \"other\" in rows 5 and 6, please enter the \"other\" category information in rows 7 and 8. The  \"Product\" tab will then be populated  with all the unique product properties listed in Tables 1 -21.                                                                                                                                                                                                                                                                                      Use the \"Reset\" button to delete all data previously entered in the \"Introduction\" tab and reset the columns in the \"Product\" tab.   \n\n                                                                  "]
["Applicant Name"]
["Product Category"]
["Product Subcategory"]
["Product Category, If other"]
["Product Subcategory, if Other"]
{"$rows_empty":11}
["Version: 2.0"]
["Release Date: 03/02/2020"]
[]
[]
["This section applies only to requirements of the Paperwork Reduction Act of 1995.\n*DO NOT SEND YOUR COMPLETED FORM TO THE PRA STAFF ADDRESS BELOW.*\nThe burden time for this collection of information is estimated to average 4 hours per response, including the time to review instructions, search existing data sources, gather and maintain the data needed and complete and review the collection of information. Send comments regarding this burden estimate or any other aspect of this information collection, including suggestions for reducing this burden, to the following email address:\nFor PRA questions:\nPRAStaff@fda.hhs.gov\nOMB Statement: “An agency may not conduct or sponsor and a person is not required to respond to, a collection of information unless it displays a currently valid OMB number.”"]

{"sheet":"Product","index":1,"n_rows":2,"n_cols":136,"rows_kept":2}
[{"$nulls":67},"Pipe","Pipe Tobacco Filler",null,null,"EX"]
["Product Name","Package Type","Package Type, if Other","Product Quantity Numeric Value","Units (Product Quantity)","Units, if Other (Product Quantity)","Product Quantity Mass Numeric Value","Units (Product Quantity Mass)","Units, if Other (Product Quantity Mass)","Characterizing Flavor","Characterizing Flavor, If other","Tobacco Cut/Particle Size Description  ","Tobacco Cut Style","Tobacco Cut/Particle Size Numeric Value","Units (Tobacco Cut/Particle Size)","Portion Count Numeric Value","Units (Portion Count)","Units, if Other (Portion Count)","Portion Mass Numeric Value","Units (Portion Mass)","Length Description","Length Description, if Other","Length Numeric Value","Units (Length)","Width Numeric Value","Units (Width)","Diameter Description","Diameter Description, if Other","Diameter Format","Diameter Numeric Value","Units (Diameter)","Portion Thickness Numeric Value","Units (Portion Thickness)","Ventilation","E-liquid Volume","E-liquid Volume Units","Nicotine Concentration","Nicotine Concentration Units","Units, if Other (Nicotine Concentration)","PG/VG Ratio","VG Numeric Value","PG/VG                     Not Applicable","Wattage Numeric Value","Units (Wattage)","Units, if Other (Wattage)","Battery Capacity Numeric Value","Units (Battery Capacity)","Units, if Other (Battery Capacity)","Tip Type","Tip Type, if Other","Wrapper Material","Wrapper Material, if Other","Number of Hoses ","Source of Energy ","Source of Energy, if Other","Height Numeric Value","Units (Height)","Additional Properties (if Applicable)",{"$nulls":18},"Predicate","Original Product","Product Name","Package Type","Package Type, if Other","Product Quantity Numeric Value","Units (Product Quantity)","Units, if Other (Product Quantity)","Product Quantity Mass Numeric Value","Units (Product Quantity Mass)","Units, if Other (Product Quantity Mass)","Characterizing Flavor","Characterizing Flavor, If other","Tobacco Cut/Particle Size Description  ","Tobacco Cut Style","Tobacco Cut/Particle Size Numeric Value","Units (Tobacco Cut/Particle Size)","Portion Count Numeric Value","Units (Portion Count)","Units, if Other (Portion Count)","Portion Mass Numeric Value","Units (Portion Mass)","Length Description","Length Description, if Other","Length Numeric Value","Units (Length)","Width Numeric Value","Units (Width)","Diameter Description","Diameter Description, if Other","Diameter Format","Diameter Numeric Value","Units (Diameter)","Portion Thickness Numeric Value","Units (Portion Thickness)","Ventilation","E-liquid Volume","E-liquid Volume Units","Nicotine Concentration","Nicotine Concentration Units","Units, if Other (Nicotine Concentration)","PG/VG Ratio ","VG Numeric Value","PG/VG                     Not Applicable","Wattage Numeric Value","Units (Wattage)","Units, if Other (Wattage)","Battery Capacity Numeric Value","Units (Battery Capacity)","Units, if Other (Battery Capacity)","Tip Type","Tip Type, if Other","Wrapper Material","Wrapper Material, if Other","Number of Hoses ","Source of Energy ","Source of Energy, if Other","Height Numeric Value","Units (Height)","Additional Properties (if Applicable)"]

{"sheet":"Sheet3","index":2,"n_rows":115,"n_cols":11,"rows_kept":115,"hidden":true}
["Category","CategoryLookup","ComponentLookUp","Look up values: category",{"$f":"INDEX(Sheet3!B2:B10, MATCH(Introduction!B5, Sheet3!A2:A10,0 ))","v":{"$error":"#N/A"}}]
["Cigarette","Cigarette","CCigarette","flavor",{"$f":"INDEX(Sheet5!D2:D65, MATCH(Introduction!B5 & Introduction!B6,Sheet5!A2:A65,0 ))","v":{"$error":"#N/A"}}]
["Cigar","Cigars","CCigars","Package Type",{"$f":"INDEX(Sheet5!B2:B65, MATCH(Introduction!B5 & Introduction!B6,Sheet5!A2:A65,0 ))","v":{"$error":"#N/A"}}]
["ENDS(VAPES)","ENDS","CENDS","Package Quantity Unit",{"$f":"INDEX(Sheet5!C2:C65, MATCH(Introduction!B5 & Introduction!B6,Sheet5!A2:A65,0 ))","v":{"$error":"#N/A"}}]
["Heated Tobacco Product","HTP","CHTP","DiameterFormat",{"$f":"INDEX(Sheet4!B2:B10, MATCH(Introduction!B5, Sheet4!A2:A10,0 ))","v":{"$error":"#N/A"}}]
["Pipe","PipeTobaccoProduct","CPipeTobaccoProduct","PortionCount",{"$f":"INDEX(Sheet4!C2:C10, MATCH(Introduction!B5, Sheet4!A2:A10,0 ))","v":{"$error":"#N/A"}}]
["Roll-Your-Own","RollYourOwn","CRollYourOwn","Component",{"$f":"INDEX(Sheet3!C2:C10, MATCH(Introduction!B5, Sheet3!A2:A10,0 ))","v":{"$error":"#N/A"}}]
["Smokeless","Smokeless","CSmokeless"]
["Waterpipe","WaterpipeTobaccoProduct","CWaterpipeTobaccoProduct"]
["Other","Other","COther"]
[]
["Subcategory"]
["Cigarette","Cigars","ENDS","PipeTobaccoProduct","RollYourOwn","Smokeless","WaterpipeTobaccoProduct","Other","HTP"]
["Filtered","Cigar Component","Closed E-Cigarette","Pipe","Filter","Dissolvable","Waterpipe","Other","Closed HTP"]
["Non-Filtered","Cigar Tobacco Filler","Closed E-Liquid","Pipe Component","Filtered Cigarette Tube","Loose Chewing Tobacco","Waterpipe Component","Unknown","Open HTP"]
["Other","Filtered, Sheet-Wrapped","ENDS Component","Pipe Tobacco Filler","Non-Filtered Cigarette Tube","Loose Dry Snuff","Waterpipe Heat Source",null,"HTP Consumable"]
[null,"Unfiltered, Leaf-Wrapped","Open E-Cigarette","Other","Paper Tip","Loose Moist Snuff","Waterpipe Tobacco Filler",null,"HTP Component"]
[null,"Unfiltered, Sheet-Wrapped","Open E-Liquid",null,"Roll-Your-Own Tobacco Filler","Loose Snus","Other",null,"Other"]
[null,"Other","Other",null,"Rolling Paper","Portioned Chewing Tobacco"]
[{"$nulls":4},"Other","Portioned Moist Snuff"]
[{"$nulls":5},"Portioned Snus"]
[{"$nulls":5},"Other"]
[]
[]
[]
[]
["AllFlavor","LimitedFlavor",null,"AllPackageType","ENDSCECigPT","ENDSCEliqPT","ENDSOECigPT","ENDSOEliqPT","WPPT","WPHSPT"]
["Blueberry ","Menthol ",null,"Bag/Pouch","Box","Cartridge","Box","Bottle","Box","Bag/Pouch"]
["Cherry ","None ",null,"Blister Pack","Clamshell","Other","Clamshell","Box","None","Box"]
["Chocolate ","Tobacco ",null,"Booklet","None",null,"None","Other","Other","Film Sleeve"]
["Cinnamon ","Other",null,"Bottle","Other",null,"Other",null,null,"None"]
["Citrus ",null,null,"Box",{"$nulls":5},"Other"]
["Coffee ",null,null,"Carton"]
["Coke ",null,null,"Cartridge","CigarLimitedPT","CigarFillerPT","CigarettePT","RYOPT","RPPT","SMKPT","RYOOPT"]
["Cola ",null,null,"Cellophane","Box","Bag/Pouch","Box","Bag/Pouch","Booklet","Bag/Pouch","Bag/Pouch"]
["Menthol ",null,null,"Clamshell","Cellophane","Metal Can and Lid","Clamshell","Box","Box","Blister Pack","Booklet"]
["Mint ",null,null,"Film Sleeve","Clamshell","Metal Can and Plastic Lid","Hard Box","Other","Other","Carton","Box"]
["Natural ",null,null,"Foil","Foil","None","Hard Pack",null,null,"Matchbook","Metal Can and Lid"]
["None ",null,null,"Hard Box","None","Plastic Can and Lid","Soft Pack",null,null,"Metal Can with Lid","Metal Can and Plastic Lid"]
["Peach ",null,null,"Hard Pack","Soft Pack","Plastic Can and Metal Lid","Other",null,null,"Metal Can with Plastic Lid","Plastic Can and Lid"]
["Peppermint",null,null,"Matchbook","Other","Other",{"$nulls":3},"Plastic Can with Lid","Plastic Can and Metal Lid"]
["Raspberry ",null,null,"Metal Can and Lid",{"$nulls":5},"Plastic Can with Metal Lid","Other"]
["Tobacco ",null,null,"Metal Can and Plastic Lid",{"$nulls":5},"Puck"]
["Vanilla ",null,null,"None","PipePT","PipeFillerPT",{"$nulls":3},"Other"]
["Wintergreen ",null,null,"Plastic Can and Lid","Box","Bag/Pouch"]
["Other",null,null,"Plastic Can and Metal Lid","None","Metal Can with Lid"]
[{"$nulls":3},"Puck","Other","Metal Can with Plastic Lid"]
[{"$nulls":3},"Soft Pack",null,"Plastic Can with Lid"]
[{"$nulls":3},"Other",null,"Plastic Can with Metal Lid"]
[{"$nulls":5},"Other"]
[{"$nulls":6},"PQU","RYOOtherPQU","HTPPQU","HTPCSPQU","HTPCPQU"]
[{"$nulls":6},"Bits","Count","Device","Cartridges","Mouthpiece"]
["AllPackageQuantityUnit","ENDSCECigPQU","ENDSCEliqPQU","ENDSOEliqPQU","CigPQU","PipePQU","Bound","Filters","HTP","Sticks","Spacer"]
["Bottles","Count","Cartridges","Bottles","Count","Pipe","Boxes","Leaves","Other","Other","Other"]
["Boxes","E-Cigarette","Other","Boxes","Other","Other","Brick","Paper"]
["Cartridges","Other",null,"Other","RYOPaperPQU",null,"Cartridges","Pieces"]
["Count","RYOFilterPQU","RYOTubePQU","RYOTipPQU","Count","PQUOther","Count","Sheet"]
["E-Cigarette","Count","Count","Count","Paper","Other","E-Cigarette","Tips"]
["Other","Filters","Tubes","Pieces","Pieces",null,"Filters","Tubes"]
[null,"Pieces","Other","Tips","Sheet",null,"Leaves","Other"]
[null,"Other",null,"Other","Other",null,"Loose Leaf Pieces"]
[{"$nulls":6},"Paper"]
["LengthUnit","DiameterFormat","VolumeUnit","NCUnit","WattUnit","BCUnit","Pellets"]
["Millimeters","Circumference","Milliliters","mg/ml","Watt","Watt","Pieces"]
["Centimeters","Diameter","Liters","%W/W","Milliwatts","Milliamps","Pipe"]
["Meters","Radius","Fluid Ounces","mg","Other","mAh","Plug"]
["Inches",null,"Kiloliters","Other",null,"Other","Pouches"]
[null,"CigarsDiameterFormat",{"$nulls":4},"Sheet"]
[null,"Circumference",{"$nulls":4},"Stick"]
[null,"Diameter",{"$nulls":4},"Strip"]
[null,"Ring Gauge",{"$nulls":4},"Tablet"]
[{"$nulls":6},"Tips"]
[null,"ENDSDiameterFormat",{"$nulls":4},"Tubes"]
[null,"Circumference",{"$nulls":4},"Twist"]
[null,"Diameter",{"$nulls":4},"Other"]
[]
[]
["EnergyTP","LengthDSC","MaterialTP","TipTP","DiameterDSC","TOBCutSizeDSC","Copackage"]
["Charcoal","King","Burley Tobacco Leaf","Wood Tip","Regular","Extra Long","Product"]
["Battery","Long","Connecticut Shade Grown Tobacco Leaf","Plastic Tip","Slim","Fine","Component"]
["Electrical","XL","Other","None","Super Slim","Long"]
["Other","Other",null,"Other","Other","Straight"]
[{"$nulls":5},"Wide"]
[]
["SMKPC","PortionCount","PortionMass","PortionThickness","TobaccoCutSize",null,"PGVGNA"]
["Bits","Bits","Milligrams","Millimeters","Millimeters",null,true]
["Bound","Bound","Grams","Centimeters","Centimeters",null,false]
["Brick","Boxes","Kilograms","Meters","Inches"]
["Count","Brick","Ounces","Inches","Cuts Per Inch (CPI)"]
["Loose Leaf Pieces","Cartridges","Pounds"]
["Pellets","Count","Tons"]
["Pieces","E-Cigarette"]
["Plug","Filters"]
["Pouches","Leaves"]
["Stick","Loose Leaf Pieces"]
["Strip","Paper"]
["Tablet","Pellets"]
["Twist","Pieces"]
["Other","Pipe"]
[null,"Plug"]
[null,"Pouches"]
[null,"Sheet"]
[null,"Stick"]
[null,"Strip"]
[null,"Tablet"]
[null,"Tips"]
[null,"Tubes"]
[null,"Twist"]
[null,"Other"]
[]
[]
["PipeFillerCutStyle"]
["Standard Cut"]
["Pressed Cut"]
["Mixture"]

{"sheet":"Sheet4","index":3,"n_rows":36,"n_cols":8,"rows_kept":36,"hidden":true}
["Cat","DiameterFormatLookUp","PortionCountLookUp",null,"CCigarette"]
["Cigarette","DiameterFormat","PortionCount",null,"CCigars"]
["Cigar","CigarDiameterFormat","PortionCount",null,"CENDS"]
["ENDS","ENDSDiameterFormat","PortionCount",null,"CPipeTobaccoProduct"]
["Pipe","ENDSDiameterFormat","PortionCount",null,"CRollYourOwn"]
["Roll-Your-Own","DiameterFormat","PortionCount",null,"CSmokeless"]
["Smokeless","DiameterFormat","SMKPC",null,"CWaterpipeTobaccoProduct"]
["Waterpipe","DiameterFormat","PQUOther",null,"COther"]
["Other","DiameterFormat","PortionCount"]
["Heated Tobacco Product","DiameterFormat","PortionCount"]
[]
[]
["IngredientType","YN"]
["SCS","Yes"]
["CI","No"]
[]
["CCigarette","CCigars","CENDS","CPipeTobaccoProduct","CRollYourOwn","CSmokeless","CWaterpipeTobaccoProduct","COther"]
["Tobacco Filler Additive","Tobacco Filler","E-Liquid","Tobacco Filler","Tobacco Filler Additive","Tobacco Filler","Tobacco Filler","Filter "]
["Adhesive","Tobacco Filler Additive","Atomizer","Tobacco Filler Additive","Adhesive","Tobacco Filler Additive","Tobacco Filler Additive","Ink (Rod Print) "]
["Filter","Adhesive","Coil/Coil Heads","Bowl","Filter","Pouch","Heat Source","Pack Inner Foil "]
["Ink (Rod Print)","Filter","Mouthpiece","Mouthpiece","Ink (Rod Print)","Other","Base","Cigarette Paper "]
["Pack Inner Foil","Tip","Tank/Cartridge","Shank (without bowl)","Cigarette Paper",null,"Bowl","Tipping Paper "]
["Cigarette Paper","Tipping Paper","Wick","Other","Tipping Paper",null,"Diffuser","Plug Wrap "]
["Tipping Paper","Plug Wrap","Other",null,"Plug Wrap",null,"Foil/Screen","Other (Specify)"]
["Plug Wrap","Wrapper/Binder",null,null,"Other",null,"Hose"]
["Other","Other",{"$nulls":4},"Mouthpiece"]
[{"$nulls":6},"Seal"]
[{"$nulls":6},"Stem"]
[{"$nulls":6},"Valve"]
[{"$nulls":6},"Other"]
[]
["Application Type"]
["PMTA"]
["MRTP"]
["SE"]
["EX"]

{"sheet":"Sheet5","index":4,"n_rows":65,"n_cols":4,"rows_kept":65,"hidden":true}
["CatSubCat","PackageTypeLookUp","PackageQuantityUnitsLookUp","FlavorLookup"]
["CigaretteCigarette Co-Package","CigarettePT","CigPQU","LimitedFlavor"]
["CigaretteFiltered","CigarettePT","CigPQU","LimitedFlavor"]
["CigaretteNon-Filtered","CigarettePT","CigPQU","LimitedFlavor"]
["CigaretteCombusted, Other","CigarettePT","CigPQU","LimitedFlavor"]
["CigaretteNon-Combusted","CigarettePT","CigPQU","LimitedFlavor"]
["CigaretteNot Provided","CigarettePT","CigPQU","LimitedFlavor"]
["CigaretteOther","CigarettePT","CigPQU","LimitedFlavor"]
["CigarCigar Co-Package","AllPackageType","PQUOther","AllFlavor"]
["CigarCigar Component","CigarLimitedPT","PQUOther","AllFlavor"]
["CigarCigar Tobacco Filler","CigarFillerPT","PQUOther","LimitedFlavor"]
["CigarFiltered, Sheet-Wrapped","CigarLimitedPT","PQUOther","AllFlavor"]
["CigarUnfiltered, Leaf-Wrapped","CigarLimitedPT","PQUOther","AllFlavor"]
["CigarUnfiltered, sheet-Wrapped","CigarLimitedPT","PQUOther","AllFlavor"]
["CigarNot Provided","AllPackageType","PQUOther","AllFlavor"]
["CigarOther","AllPackageType","PQUOther","AllFlavor"]
["ENDS(VAPES)Closed E-Cigarette","ENDSCECigPT","ENDSCECigPQU","AllFlavor"]
["ENDS(VAPES)Closed E-Liquid","ENDSCEliqPT","ENDSCEliqPQU","AllFlavor"]
["ENDS(VAPES)ENDS Co-Package","ENDSCECigPT","ENDSCECigPQU","AllFlavor"]
["ENDS(VAPES)ENDS Component","ENDSCECigPT","ENDSCECigPQU","AllFlavor"]
["ENDS(VAPES)Open E-Cigarette","ENDSOECigPT","ENDSCECigPQU","AllFlavor"]
["ENDS(VAPES)Open E-Liquid","ENDSOEliqPT","ENDSOEliqPQU","AllFlavor"]
["ENDS(VAPES)Not Provided","AllPackageType","AllPackageQuantityUnit","AllFlavor"]
["ENDS(VAPES)Other","AllPackageType","AllPackageQuantityUnit","AllFlavor"]
["PipePipe","PipePT","PipePQU","LimitedFlavor"]
["PipePipe Co-Package","AllPackageType","PipePQU","AllFlavor"]
["PipePipe Component","PipePT","PQUOther","AllFlavor"]
["PipePipe Tobacco Filler","PipeFillerPT","PipePQU","AllFlavor"]
["PipeNot Provided","AllPackageType","PipePQU","AllFlavor"]
["PipeOther","AllPackageType","PipePQU","AllFlavor"]
["Roll-Your-OwnFilter","RYOPT","RYOFilterPQU","LimitedFlavor"]
["Roll-Your-OwnFiltered Cigarette Tube","RYOPT","RYOTubePQU","LimitedFlavor"]
["Roll-Your-OwnNon-Filtered Cigarette Tube","RYOPT","RYOTubePQU","LimitedFlavor"]
["Roll-Your-OwnPaper Tip","RYOPT","RYOTipPQU","LimitedFlavor"]
["Roll-Your-OwnRoll-Your-Own Co-Package","RYOOPT","RYOOtherPQU","LimitedFlavor"]
["Roll-Your-OwnRoll-Your-Own Tobacco Filler","PipeFillerPT","RYOOtherPQU","LimitedFlavor"]
["Roll-Your-OwnRolling Paper","RPPT","RYOPaperPQU","LimitedFlavor"]
["Roll-Your-OwnNot Provided","RYOOPT","RYOOtherPQU","LimitedFlavor"]
["Roll-Your-OwnOther","RYOOPT","RYOOtherPQU","LimitedFlavor"]
["SmokelessDissolvable","SMKPT","SMKPC","AllFlavor"]
["SmokelessLoose Chewing Tobacco","SMKPT","SMKPC","AllFlavor"]
["SmokelessLoose Dry Snuff","SMKPT","SMKPC","AllFlavor"]
["SmokelessLoose Moist Snuff","SMKPT","SMKPC","AllFlavor"]
["SmokelessLoose Snus","SMKPT","SMKPC","AllFlavor"]
["SmokelessPortioned Chewing Tobacco","SMKPT","SMKPC","AllFlavor"]
["SmokelessPortioned Moist Snuff","SMKPT","SMKPC","AllFlavor"]
["SmokelessPortioned Snus","SMKPT","SMKPC","AllFlavor"]
["SmokelessSmokeless Co-Package","SMKPT","SMKPC","AllFlavor"]
["SmokelessNot Provided","SMKPT","SMKPC","AllFlavor"]
["SmokelessOther","SMKPT","SMKPC","AllFlavor"]
["WaterpipeWaterpipe","WPPT","PQUOther","AllFlavor"]
["WaterpipeWaterpipe Co-Package","AllPackageType","PQUOther","AllFlavor"]
["WaterpipeWaterpipe Component","PQUOther","PQUOther","AllFlavor"]
["WaterpipeWaterpipe Heat Source","WPHSPT","PQUOther","AllFlavor"]
["WaterpipeWaterpipe Tobacco Filler","SMKPT","PortionCount","AllFlavor"]
["WaterpipeNot Provided","AllPackageType","PQUOther","AllFlavor"]
["WaterpipeOther","AllPackageType","PQUOther","AllFlavor"]
["OtherNot Provided","AllPackageType","PortionCount","AllFlavor"]
["OtherOther","AllPackageType","PortionCount","AllFlavor"]
["OtherUnknown","AllPackageType","PortionCount","AllFlavor"]
["Heated Tobacco ProductClosed HTP","ENDSCECigPT","HTPPQU","AllFlavor"]
["Heated Tobacco ProductOpen HTP","ENDSCECigPT","HTPPQU","AllFlavor"]
["Heated Tobacco ProductHTP Consumable","AllPackageType","HTPCSPQU","AllFlavor"]
["Heated Tobacco ProductHTP Component","AllPackageType","HTPCPQU","AllFlavor"]
["Heated Tobacco ProductOther","AllPackageType","PQU","AllFlavor"]