{"text_format":"3","workbook":"xlsx","n_sheets":10,"sheets":["Instructions","Section 1","Section 2","Section 3","Summary","Reference List","Lists","Checks","OutputForCSV","TempOutput"],"not_rendered":{"macros":1,"defined_names":41,"comments":4},"read":"whole","date_system":"1900"}

{"sheet":"Instructions","index":0,"n_rows":21,"n_cols":3,"rows_kept":21}
[]
[null,null,"U.S. Environmental Protection Agency"]
[null,null,"Stratospheric Ozone Protection Program"]
[]
[null,null,"Class II Producer Quarterly Report \n(Sec 82.24)"]
[null,null,"Version 3.0"]
[null,null,"Last Updated: March 2019"]
[]
[null,null,"Instructions"]
[null,null,"Complete this form by filling in the data fields that are highlighted in blue.  Guidance on how to complete individual data fields are provided in comment bubbles. Use the arrows to navigate between the tabs. Once completed, use the 'prepare submission' button on the Summary tab to generate your CSV file.  "]
[null,null,"Copying and Pasting Data: If data are pasted into this reporting form from another spreadsheet, the formatting of specific cells must be consistent with the requirements of the form in order to be "]
[null,null,"accepted into EPA’s ODS Tracking System. Refer to the Reference List to identify the valid naming scheme for specific data fields. Additionally, select \"Paste As Values\" when pasting data into the form."]
[null,null,"Report Submission: This Excel file, the generated CSV file, and all supporting attachments should be submitted to EPA through the Central Data Exchange (CDX). Refer to EPA's website for additional information on form submission:"]
[null,null,"https://www.epa.gov/ods-phaseout/ods-recordkeeping-and-reporting"]
[]
{"$rows_left_out":7}
{"sheet":"Section 1","index":1,"n_rows":15,"n_cols":9,"rows_kept":15,"merged":[[7,2,7,3]]}
[]
[null,null,"U.S. Environmental Protection Agency"]
[null,null,"Class II Producer Quarterly Report"]
[]
[null,null,"   Date Prepared:",{"$f":"TODAY()","v":"2019-03-28"}]
[]
[null,null,"Section 1: Report Identification Information "]
[null,null,"Complete all fields below.  No fields may be left blank."]
[null,null,"Company Name: ",null,null,{"$f":"IF($D$9=0,1,0)","v":1}]
[null,null,"Submission Type:",null,null,{"$f":"IF(OR(SubTSelection=Lists!C3,SubTSelection=Lists!C4),0,1)","v":1},null,null,{"$f":"IF(SubTSelection=\"\",\"\",IF(OR(SubTSelection=Lists!C3,SubTSelection=Lists!C4),\"\",\"PLEASE SELECT A VALID SUBMISSION TYPE FROM THE DROPDOWN LIST\"))","v":""}]
[null,null,"Reporting Year:",null,null,{"$f":"IF(OR($D$11=0,$D$11>Lists!$E$3),1,0)","v":1},null,null,{"$f":"IF(D11>Lists!E3,\"PLEASE CHOOSE A CURRENT OR PAST YEAR\",\"\")","v":""}]
[null,null,"Reporting Quarter:",null,null,{"$f":"IF(OR(ReportQtr=0,ReportQtr>Lists!F6),1,0)","v":1},null,null,{"$f":"IF(ReportQtr>Lists!F6,\"PLEASE SELECT A VALID QUARTER FROM THE DROPDOWN LIST\",\"\")","v":""}]
[{"$nulls":3},"x"]
[{"$nulls":3},{"$f":"Lists!C3","v":"Original Submission"}]
[{"$nulls":3},{"$f":"Lists!C4","v":"Re-Submittal"}]
{"$rows_left_out":1}
{"sheet":"Section 2","index":2,"n_rows":62,"n_cols":19,"rows_kept":62,"merged":[[8,3,8,10],[9,3,9,10]]}
[]
[{"$nulls":3},"U.S. Environmental Protection Agency"]
[{"$nulls":3},"Class II Producer Quarterly Report"]
[]
[{"$nulls":3},"Company Name:",{"$f":"IF('Section 1'!D9=0,\"\",'Section 1'!D9)","v":""}]
[{"$nulls":3},"Reporting Period:",{"$f":"IF(OR('Section 1'!D11=0,'Section 1'!D12=0),\"\",\"Quarter \"&'Section 1'!D12&\", \"&'Section 1'!D11)","v":""}]
[]
[{"$nulls":3},"Section 2: Production Data"]
[{"$nulls":3},"In the table below, enter the quantity of each class II controlled substance that was produced during the reporting period.  If no controlled substances were produced, the table may be left blank.  As a reminder, if material was produced for second party transformation, second party destruction, or produced using Article 5 allowances (but sold domestically prior to export), a copy of the transformation, destruction, and/or Article 5 verification from each company for whom material was produced must be provided to EPA along with the submission of this report.\n"]
[{"$nulls":3},"If copying and pasting data into the table, please refer to the Reference List and the accompanying instructions."]
[{"$nulls":3},"Name of the Class II Chemical Produced","Gross Production","In-House Transformation ","Second Party Transformation ","In-House Destruction ","Second Party Destruction ","Article 5 ","Net Production"]
[{"$nulls":3},"Selection","kg","kg","kg","kg","kg","kg","Autopopulated"]
[{"$nulls":3},"HCFC-22",{"v":1550.65,"d":"1,550.65"},{"v":0,"d":"0.00"},250.85,{"v":0,"d":"0.00"},{"v":0,"d":"0.00"},{"v":1008,"d":"1,008.00"},{"$f":"E13-F13-G13-H13-I13-J13","v":{"v":291.8000000000002,"d":"291.80"}},{"$nulls":3},"Active Row?","Duplicate Check","Production Check","Sec 3 Inclusion","Valid Chem Name"]
[{"$f":"IF(D14=0,\"\",1)","v":""},{"$nulls":9},{"$f":"IF(D14=0,\"\",ROUND(E14-F14-G14-H14-I14-J14,2))","v":""},{"$nulls":3},{"$f":"IF(A14=\"\",\"N\",\"Y\")","v":"N"},{"$f":"IF(D14=0,0,IF(COUNTIF($D$14:$D$23,D14)>1,1,0))","v":0},{"$f":"IF(AND(D14<>0,E14=0),1,0)","v":0},{"$f":"IF(SUM(G14,I14)>0,IF(COUNTIF('Section 3'!$D$16:$D$25,D14)=0,1,0),0)","v":0},{"$f":"IF(D14=0,0,IF(COUNTIF(ClassIIChemicals,D14)>0,0,1))","v":0}]
[{"$f":"IF(D15=0,\"\",MAX($A$14:A14)+1)","v":""},{"$nulls":9},{"$f":"IF(D15=0,\"\",ROUND(E15-F15-G15-H15-I15-J15,2))","v":""},{"$nulls":3},{"$f":"IF(A15=\"\",\"N\",\"Y\")","v":"N"},{"$f":"IF(D15=0,0,IF(COUNTIF($D$14:$D$23,D15)>1,1,0))","v":0},{"$f":"IF(AND(D15<>0,E15=0),1,0)","v":0},{"$f":"IF(SUM(G15,I15)>0,IF(COUNTIF('Section 3'!$D$16:$D$25,D15)=0,1,0),0)","v":0},0]
{"$rows_left_out":48}
{"sheet":"Section 3","index":3,"n_rows":64,"n_cols":17,"rows_kept":64,"merged":[[8,3,8,6],[9,3,9,6],[10,3,10,6],[11,3,11,6]]}
[]
[{"$nulls":3},"U.S. Environmental Protection Agency"]
[{"$nulls":3},"Class II Producer Quarterly Report"]
[]
[{"$nulls":3},"Company Name:",{"$f":"IF('Section 1'!D9=0,\"\",'Section 1'!D9)","v":""}]
[{"$nulls":3},"Reporting Period:",{"$f":"IF(OR('Section 1'!D11=0,'Section 1'!D12=0),\"\",\"Quarter \"&'Section 1'!D12&\", \"&'Section 1'!D11)","v":""}]
[]
[{"$nulls":3},"Section 3: Shipment/Sales Data"]
[{"$nulls":3},"Identify the recipient company(s) of the material produced for second party transformation, second party destruction, or produced with Article 5 allowances (but sold domestically), and the amount shipped to each company during the quarter. "]
[{"$nulls":3},"Note: Due to a potential time lag between the date of production and the date of shipment, it is recognized that for a given quarter the information in Section 3 may not match the information reported in Section 2; however, it is expected that all material produced for second party transformation or second party destruction will eventually be shipped to a second party and must be reported as such in the applicable quarterly report."]
[{"$nulls":3},"If copying and pasting data into the table, please refer to the Reference List and the accompanying instructions."]
[{"$nulls":3},"As a reminder, a copy of the transformation, destruction, and/or Article 5 verification from each company for which material was produced must be provided to EPA along with the submission of this report."]
[{"$nulls":3},"Chemical Name","Recipient Company Name","Quantity","Purpose"]
[{"$nulls":3},"Selection","Text","kg","Selection"]
[{"$nulls":3},"HCFC-22","Company A",250.85,"Transformation",{"$nulls":4},"ActiveRow?","Character Check","Sec 2 Inclusion","Completeness check","Valid Chem Name","Valid Purpose"]
{"$rows_left_out":50}
{"sheet":"Summary","index":4,"n_rows":18,"n_cols":7,"rows_kept":18,"merged":[[8,3,8,6],[9,3,10,3],[9,4,9,6]]}
[]
[{"$nulls":3},"U.S. Environmental Protection Agency"]
[{"$nulls":3},"Class II Producer Quarterly Report"]
[]
[{"$nulls":3},"Company Name:",{"$f":"IF('Section 1'!D9=0,\"\",'Section 1'!D9)","v":""}]
[{"$nulls":3},"Reporting Period:",{"$f":"IF(OR('Section 1'!D11=0,'Section 1'!D12=0),\"\",\"Quarter \"&'Section 1'!D12&\", \"&'Section 1'!D11)","v":""}]
[]
[{"$nulls":3},"Allowance Summary"]
[{"$nulls":3},"The values in the table below are calculated based on data entered in Section 2 for chemicals that have allowances.  If the totals appear to be incorrect, please return to Section 2 to review your data."]
[{"$nulls":3},"Chemical Name","Allowances Expended (kg)"]
[1,{"$nulls":3},"Production ","Consumption ","Article 5"]
[2,null,null,{"$f":"IFERROR(VLOOKUP(A11,Lists!$N$3:$O$9,2,0),\"\")","v":""},{"$f":"IFERROR(VLOOKUP($D12,'Section 2'!$D$14:$K$23,8,FALSE),\" \")","v":" "},{"$f":"IFERROR(VLOOKUP($D12,'Section 2'!$D$14:$K$23,8,FALSE),\" \")","v":" "},{"$f":"IFERROR(VLOOKUP($D12,'Section 2'!$D$14:$K$23,7,FALSE),\" \")","v":" "}]
[3,null,null,{"$f":"IFERROR(VLOOKUP(A12,Lists!$N$3:$O$9,2,0),\"\")","v":""},{"$f":"IFERROR(VLOOKUP($D13,'Section 2'!$D$14:$K$23,8,FALSE),\" \")","v":" "},{"$f":"IFERROR(VLOOKUP($D13,'Section 2'!$D$14:$K$23,8,FALSE),\" \")","v":" "},{"$f":"IFERROR(VLOOKUP($D13,'Section 2'!$D$14:$K$23,7,FALSE),\" \")","v":" "}]
[4,null,null,{"$f":"IFERROR(VLOOKUP(A13,Lists!$N$3:$O$9,2,0),\"\")","v":""},{"$f":"IFERROR(VLOOKUP($D14,'Section 2'!$D$14:$K$23,8,FALSE),\" \")","v":" "},{"$f":"IFERROR(VLOOKUP($D14,'Section 2'!$D$14:$K$23,8,FALSE),\" \")","v":" "},{"$f":"IFERROR(VLOOKUP($D14,'Section 2'!$D$14:$K$23,7,FALSE),\" \")","v":" "}]
[5,null,null,{"$f":"IFERROR(VLOOKUP(A14,Lists!$N$3:$O$9,2,0),\"\")","v":""},{"$f":"IFERROR(VLOOKUP($D15,'Section 2'!$D$14:$K$23,8,FALSE),\" \")","v":" "},{"$f":"IFERROR(VLOOKUP($D15,'Section 2'!$D$14:$K$23,8,FALSE),\" \")","v":" "},{"$f":"IFERROR(VLOOKUP($D15,'Section 2'!$D$14:$K$23,7,FALSE),\" \")","v":" "}]
{"$rows_left_out":4}
{"sheet":"Reference List","index":5,"n_rows":18,"n_cols":7,"rows_kept":18,"merged":[[5,2,5,6],[6,2,6,6],[8,2,8,6]]}
[]
[null,null,"U.S. Environmental Protection Agency"]
[null,null,"Class II Producer Quarterly Report"]
[null,null,"Reference List"]
[]
[null,null,"Copying and Pasting Data: If data are pasted into this reporting form from another spreadsheet, the formatting of specific cells must be consistent with the requirements of the form in order to be accepted into EPA’s ODS tracking system.  When copying and pasting data into the form, please ensure consistency with the formatting of the list below."]
[null,null,"Chemical Name List: The table below lists the valid chemical names that may be used when entering data into Section 2 and Section 3 of this form. "]
[]
[null,null,"Chemical Name"]
[null,null,"HCFC-21","HCFC-124a","HCFC-142b","HCFC-231","HCFC-251"]
[null,null,"HCFC-22","HCFC-131","HCFC-151","HCFC-232","HCFC-252"]
[null,null,"HCFC-31","HCFC-132b","HCFC-221","HCFC-233","HCFC-253"]
[null,null,"HCFC-121","HCFC-133a","HCFC-222","HCFC-234","HCFC-261"]
[null,null,"HCFC-122","HCFC-141","HCFC-223","HCFC-235","HCFC-262"]
[null,null,"HCFC-123","HCFC-141a","HCFC-224","HCFC-241","HCFC-271"]
{"$rows_left_out":4}
{"sheet":"Lists","index":6,"n_rows":44,"n_cols":18,"rows_kept":44,"hidden":true}
[{"$nulls":16},"Variables for Data Submission"]
[null,"Chemical Name","Submission Type","Reporting Year","Current Year","Reporting Quarter","Purpose","Date for CSV Title","Form Name for CSV Title",null,"Form Type","Form Code",null,"Selected?","Chem List with Allowances",null,null,"Row #"]
[null,"HCFC-21","Original Submission",2018,{"$f":"YEAR(TODAY())","v":2019},1,"Transformation",{"$f":"MONTH(SubDate)&\"-\"&DAY(SubDate)&\"-\"&YEAR(SubDate)","v":"3-28-2019"},"Class II Producer",null,"Class I Producer","PROD1",null,{"$f":"IF(COUNTIF('Section 2'!$D$14:$D$23,O3)>0,1,0)","v":0},"HCFC-22",null,"Sec2End",{"$f":"IF(MAX(OutputForCSV!A2:A11)=0,1,MAX(OutputForCSV!A2:A11))","v":1}]
[null,"HCFC-22","Re-Submittal",2019,null,2,"Destruction",{"$nulls":3},"MeBr Producer","PROD3",null,{"$f":"IF(COUNTIF('Section 2'!$D$14:$D$23,O4)>0,MAX($N$3:N3)+1,0)","v":0},"HCFC-123",null,"Sec3Start",{"$f":"OutputForCSV!A12","v":""}]
[null,"HCFC-31",null,2020,null,3,"Article 5",{"$nulls":3},"Class II Producer","PROD2",null,{"$f":"IF(COUNTIF('Section 2'!$D$14:$D$23,O5)>0,MAX($N$3:N4)+1,0)","v":0},"HCFC-124",null,"Sec3End",{"$f":"MAX(OutputForCSV!A12:A21)","v":0}]
[null,"HCFC-121",{"$nulls":3},4,{"$nulls":4},"Class I Importer","IMPT1",null,{"$f":"IF(COUNTIF('Section 2'!$D$14:$D$23,O6)>0,MAX($N$3:N5)+1,0)","v":0},"HCFC-141b",null,"MaxTempRow",{"$f":"IF(MAX(TempOutput!A2:A21)=0,1,MAX(TempOutput!A2:A21))","v":1}]
[null,"HCFC-122",{"$nulls":8},"MeBr Importer","IMPT3",null,{"$f":"IF(COUNTIF('Section 2'!$D$14:$D$23,O7)>0,MAX($N$3:N6)+1,0)","v":0},"HCFC-142b",null,"Sec3PasteRow",{"$f":"IF(R3=0,2,R3+1)","v":2}]
[null,"HCFC-123",{"$nulls":8},"Class II Importer","IMPT2",null,{"$f":"IF(COUNTIF('Section 2'!$D$14:$D$23,O8)>0,MAX($N$3:N7)+1,0)","v":0},"HCFC-225ca"]
[null,"HCFC-123a",{"$nulls":8},"Class I Exporter","EXPT1",null,{"$f":"IF(COUNTIF('Section 2'!$D$14:$D$23,O9)>0,MAX($N$3:N8)+1,0)","v":0},"HCFC-225cb"]
[null,"HCFC-123b",{"$nulls":8},"MeBr Exporter","EXPT3"]
[null,"HCFC-124",{"$nulls":8},"Class II Exporter","EXPT2"]
[null,"HCFC-124a",{"$nulls":8},"Class I Lab Supplier","LABS1"]
[null,"HCFC-131",{"$nulls":8},"Class I Destruction","DEST1"]
[null,"HCFC-132b",{"$nulls":8},"MeBr Destruction","DEST3"]
[null,"HCFC-133a",{"$nulls":8},"Class II Destruction","DEST2"]
{"$rows_left_out":30}
{"sheet":"Checks","index":7,"n_rows":23,"n_cols":4,"rows_kept":23,"hidden":true}
[]
[null,"Section","Check Description","Status (1 = Incomplete, 0 = Complete)"]
[null,"Section 1","All",{"$f":"IF(SUM('Section 1'!F9:F12)>0,1,0)","v":1}]
[null,"Section 2","Duplicates",{"$f":"IF(SUM('Section 2'!P14:P23)>0,1,0)","v":0}]
[null,"Section 2","Negative Net Production",{"$f":"IF(MIN('Section 2'!$K$14:$K$23)<0,1,0)","v":0}]
[null,"Section 2","Gross Production Check",{"$f":"IF(SUM('Section 2'!Q14:Q23)>0,1,0)","v":0}]
[null,"Section 2","Valid Chem Name",{"$f":"IF(SUM('Section 2'!S14:S23)>0,1,0)","v":0}]
[null,"Section 2","Error Check",{"$f":"IF(SUM(D4:D7)>0,1,0)","v":0}]
[null,"Section 2","Filled Out?",{"$f":"IF(SUM('Section 2'!E14:E23)>0,0,1)","v":1}]
[null,"Section 3","Valid Chem Name",{"$f":"IF(SUM('Section 3'!P16:P25)>0,1,0)","v":0}]
[null,"Section 3","Valid Purpose",{"$f":"IF(SUM('Section 3'!Q16:Q25)>0,1,0)","v":0}]
[null,"Section 3","Complete?",{"$f":"IF(SUM('Section 3'!O16:O25)>0,1,0)","v":0}]
[null,"Section 3","Error Check",{"$f":"IF(SUM(D10:D12)>0,1,0)","v":0}]
[null,"Section 3","Sec2 2nd party trans/destruction reflected in Sec 3?",{"$f":"IF(SUM('Section 2'!R14:R23)>0,1,0)","v":0}]
[null,"Section 3","Sec 3 reflected in Sec 2?",{"$f":"IF(SUM('Section 3'!N16:N25)>0,1,0)","v":0}]
{"$rows_left_out":9}
{"sheet":"OutputForCSV","index":8,"n_rows":22,"n_cols":12,"rows_kept":22,"hidden":true}
["Row #","Entry",1,"PROD2","3",{"$f":"'Section 1'!D5","v":"2019-03-28"},{"$f":"'Section 1'!D9","v":0},{"$f":"'Section 1'!D10","v":0},{"$f":"'Section 1'!D11","v":0},{"$f":"'Section 1'!D12","v":0},null,"LastColumn"]
[{"$f":"IF(D2=\"\",\"\",ROWS($A$1:A2))","v":""},1,{"$f":"IF(D2=\"\",\"\",2)","v":""},{"$f":"IFERROR(VLOOKUP($B2,'Section 2'!$A$14:$K$23,COLUMNS('Section 2'!$A$14:D$14),0),\"\")","v":""},{"$f":"IFERROR(VLOOKUP($B2,'Section 2'!$A$14:$K$23,COLUMNS('Section 2'!$A$14:E$14),0),\"\")","v":""},{"$f":"IFERROR(VLOOKUP($B2,'Section 2'!$A$14:$K$23,COLUMNS('Section 2'!$A$14:F$14),0),\"\")","v":""},{"$f":"IFERROR(VLOOKUP($B2,'Section 2'!$A$14:$K$23,COLUMNS('Section 2'!$A$14:G$14),0),\"\")","v":""},{"$f":"IFERROR(VLOOKUP($B2,'Section 2'!$A$14:$K$23,COLUMNS('Section 2'!$A$14:H$14),0),\"\")","v":""},{"$f":"IFERROR(VLOOKUP($B2,'Section 2'!$A$14:$K$23,COLUMNS('Section 2'!$A$14:I$14),0),\"\")","v":""},{"$f":"IFERROR(VLOOKUP($B2,'Section 2'!$A$14:$K$23,COLUMNS('Section 2'!$A$14:J$14),0),\"\")","v":""}]
[{"$f":"IF(D3=\"\",\"\",ROWS($A$1:A3))","v":""},2,{"$f":"IF(D3=\"\",\"\",2)","v":""},{"$f":"IFERROR(VLOOKUP($B3,'Section 2'!$A$14:$K$23,COLUMNS('Section 2'!$A$14:D$14),0),\"\")","v":""},{"$f":"IFERROR(VLOOKUP($B3,'Section 2'!$A$14:$K$23,COLUMNS('Section 2'!$A$14:E$14),0),\"\")","v":""},{"$f":"IFERROR(VLOOKUP($B3,'Section 2'!$A$14:$K$23,COLUMNS('Section 2'!$A$14:F$14),0),\"\")","v":""},{"$f":"IFERROR(VLOOKUP($B3,'Section 2'!$A$14:$K$23,COLUMNS('Section 2'!$A$14:G$14),0),\"\")","v":""},{"$f":"IFERROR(VLOOKUP($B3,'Section 2'!$A$14:$K$23,COLUMNS('Section 2'!$A$14:H$14),0),\"\")","v":""},{"$f":"IFERROR(VLOOKUP($B3,'Section 2'!$A$14:$K$23,COLUMNS('Section 2'!$A$14:I$14),0),\"\")","v":""},{"$f":"IFERROR(VLOOKUP($B3,'Section 2'!$A$14:$K$23,COLUMNS('Section 2'!$A$14:J$14),0),\"\")","v":""}]
[{"$f":"IF(D4=\"\",\"\",ROWS($A$1:A4))","v":""},3,"",{"$f":"IFERROR(VLOOKUP($B4,'Section 2'!$A$14:$K$23,COLUMNS('Section 2'!$A$14:D$14),0),\"\")","v":""},{"$f":"IFERROR(VLOOKUP($B4,'Section 2'!$A$14:$K$23,COLUMNS('Section 2'!$A$14:E$14),0),\"\")","v":""},{"$f":"IFERROR(VLOOKUP($B4,'Section 2'!$A$14:$K$23,COLUMNS('Section 2'!$A$14:F$14),0),\"\")","v":""},{"$f":"IFERROR(VLOOKUP($B4,'Section 2'!$A$14:$K$23,COLUMNS('Section 2'!$A$14:G$14),0),\"\")","v":""},{"$f":"IFERROR(VLOOKUP($B4,'Section 2'!$A$14:$K$23,COLUMNS('Section 2'!$A$14:H$14),0),\"\")","v":""},{"$f":"IFERROR(VLOOKUP($B4,'Section 2'!$A$14:$K$23,COLUMNS('Section 2'!$A$14:I$14),0),\"\")","v":""},{"$f":"IFERROR(VLOOKUP($B4,'Section 2'!$A$14:$K$23,COLUMNS('Section 2'!$A$14:J$14),0),\"\")","v":""}]
[{"$f":"IF(D5=\"\",\"\",ROWS($A$1:A5))","v":""},4,"",{"$f":"IFERROR(VLOOKUP($B5,'Section 2'!$A$14:$K$23,COLUMNS('Section 2'!$A$14:D$14),0),\"\")","v":""},{"$f":"IFERROR(VLOOKUP($B5,'Section 2'!$A$14:$K$23,COLUMNS('Section 2'!$A$14:E$14),0),\"\")","v":""},{"$f":"IFERROR(VLOOKUP($B5,'Section 2'!$A$14:$K$23,COLUMNS('Section 2'!$A$14:F$14),0),\"\")","v":""},{"$f":"IFERROR(VLOOKUP($B5,'Section 2'!$A$14:$K$23,COLUMNS('Section 2'!$A$14:G$14),0),\"\")","v":""},{"$f":"IFERROR(VLOOKUP($B5,'Section 2'!$A$14:$K$23,COLUMNS('Section 2'!$A$14:H$14),0),\"\")","v":""},{"$f":"IFERROR(VLOOKUP($B5,'Section 2'!$A$14:$K$23,COLUMNS('Section 2'!$A$14:I$14),0),\"\")","v":""},{"$f":"IFERROR(VLOOKUP($B5,'Section 2'!$A$14:$K$23,COLUMNS('Section 2'!$A$14:J$14),0),\"\")","v":""}]
[{"$f":"IF(D6=\"\",\"\",ROWS($A$1:A6))","v":""},5,"",{"$f":"IFERROR(VLOOKUP($B6,'Section 2'!$A$14:$K$23,COLUMNS('Section 2'!$A$14:D$14),0),\"\")","v":""},{"$f":"IFERROR(VLOOKUP($B6,'Section 2'!$A$14:$K$23,COLUMNS('Section 2'!$A$14:E$14),0),\"\")","v":""},{"$f":"IFERROR(VLOOKUP($B6,'Section 2'!$A$14:$K$23,COLUMNS('Section 2'!$A$14:F$14),0),\"\")","v":""},{"$f":"IFERROR(VLOOKUP($B6,'Section 2'!$A$14:$K$23,COLUMNS('Section 2'!$A$14:G$14),0),\"\")","v":""},{"$f":"IFERROR(VLOOKUP($B6,'Section 2'!$A$14:$K$23,COLUMNS('Section 2'!$A$14:H$14),0),\"\")","v":""},{"$f":"IFERROR(VLOOKUP($B6,'Section 2'!$A$14:$K$23,COLUMNS('Section 2'!$A$14:I$14),0),\"\")","v":""},{"$f":"IFERROR(VLOOKUP($B6,'Section 2'!$A$14:$K$23,COLUMNS('Section 2'!$A$14:J$14),0),\"\")","v":""}]
[{"$f":"IF(D7=\"\",\"\",ROWS($A$1:A7))","v":""},6,"",{"$f":"IFERROR(VLOOKUP($B7,'Section 2'!$A$14:$K$23,COLUMNS('Section 2'!$A$14:D$14),0),\"\")","v":""},{"$f":"IFERROR(VLOOKUP($B7,'Section 2'!$A$14:$K$23,COLUMNS('Section 2'!$A$14:E$14),0),\"\")","v":""},{"$f":"IFERROR(VLOOKUP($B7,'Section 2'!$A$14:$K$23,COLUMNS('Section 2'!$A$14:F$14),0),\"\")","v":""},{"$f":"IFERROR(VLOOKUP($B7,'Section 2'!$A$14:$K$23,COLUMNS('Section 2'!$A$14:G$14),0),\"\")","v":""},{"$f":"IFERROR(VLOOKUP($B7,'Section 2'!$A$14:$K$23,COLUMNS('Section 2'!$A$14:H$14),0),\"\")","v":""},{"$f":"IFERROR(VLOOKUP($B7,'Section 2'!$A$14:$K$23,COLUMNS('Section 2'!$A$14:I$14),0),\"\")","v":""},{"$f":"IFERROR(VLOOKUP($B7,'Section 2'!$A$14:$K$23,COLUMNS('Section 2'!$A$14:J$14),0),\"\")","v":""}]
[{"$f":"IF(D8=\"\",\"\",ROWS($A$1:A8))","v":""},7,"",{"$f":"IFERROR(VLOOKUP($B8,'Section 2'!$A$14:$K$23,COLUMNS('Section 2'!$A$14:D$14),0),\"\")","v":""},{"$f":"IFERROR(VLOOKUP($B8,'Section 2'!$A$14:$K$23,COLUMNS('Section 2'!$A$14:E$14),0),\"\")","v":""},{"$f":"IFERROR(VLOOKUP($B8,'Section 2'!$A$14:$K$23,COLUMNS('Section 2'!$A$14:F$14),0),\"\")","v":""},{"$f":"IFERROR(VLOOKUP($B8,'Section 2'!$A$14:$K$23,COLUMNS('Section 2'!$A$14:G$14),0),\"\")","v":""},{"$f":"IFERROR(VLOOKUP($B8,'Section 2'!$A$14:$K$23,COLUMNS('Section 2'!$A$14:H$14),0),\"\")","v":""},{"$f":"IFERROR(VLOOKUP($B8,'Section 2'!$A$14:$K$23,COLUMNS('Section 2'!$A$14:I$14),0),\"\")","v":""},{"$f":"IFERROR(VLOOKUP($B8,'Section 2'!$A$14:$K$23,COLUMNS('Section 2'!$A$14:J$14),0),\"\")","v":""}]
[{"$f":"IF(D9=\"\",\"\",ROWS($A$1:A9))","v":""},8,"",{"$f":"IFERROR(VLOOKUP($B9,'Section 2'!$A$14:$K$23,COLUMNS('Section 2'!$A$14:D$14),0),\"\")","v":""},{"$f":"IFERROR(VLOOKUP($B9,'Section 2'!$A$14:$K$23,COLUMNS('Section 2'!$A$14:E$14),0),\"\")","v":""},{"$f":"IFERROR(VLOOKUP($B9,'Section 2'!$A$14:$K$23,COLUMNS('Section 2'!$A$14:F$14),0),\"\")","v":""},{"$f":"IFERROR(VLOOKUP($B9,'Section 2'!$A$14:$K$23,COLUMNS('Section 2'!$A$14:G$14),0),\"\")","v":""},{"$f":"IFERROR(VLOOKUP($B9,'Section 2'!$A$14:$K$23,COLUMNS('Section 2'!$A$14:H$14),0),\"\")","v":""},{"$f":"IFERROR(VLOOKUP($B9,'Section 2'!$A$14:$K$23,COLUMNS('Section 2'!$A$14:I$14),0),\"\")","v":""},{"$f":"IFERROR(VLOOKUP($B9,'Section 2'!$A$14:$K$23,COLUMNS('Section 2'!$A$14:J$14),0),\"\")","v":""}]
[{"$f":"IF(D10=\"\",\"\",ROWS($A$1:A10))","v":""},9,"",{"$f":"IFERROR(VLOOKUP($B10,'Section 2'!$A$14:$K$23,COLUMNS('Section 2'!$A$14:D$14),0),\"\")","v":""},{"$f":"IFERROR(VLOOKUP($B10,'Section 2'!$A$14:$K$23,COLUMNS('Section 2'!$A$14:E$14),0),\"\")","v":""},{"$f":"IFERROR(VLOOKUP($B10,'Section 2'!$A$14:$K$23,COLUMNS('Section 2'!$A$14:F$14),0),\"\")","v":""},{"$f":"IFERROR(VLOOKUP($B10,'Section 2'!$A$14:$K$23,COLUMNS('Section 2'!$A$14:G$14),0),\"\")","v":""},{"$f":"IFERROR(VLOOKUP($B10,'Section 2'!$A$14:$K$23,COLUMNS('Section 2'!$A$14:H$14),0),\"\")","v":""},{"$f":"IFERROR(VLOOKUP($B10,'Section 2'!$A$14:$K$23,COLUMNS('Section 2'!$A$14:I$14),0),\"\")","v":""},{"$f":"IFERROR(VLOOKUP($B10,'Section 2'!$A$14:$K$23,COLUMNS('Section 2'!$A$14:J$14),0),\"\")","v":""}]
[{"$f":"IF(D11=\"\",\"\",ROWS($A$1:A11))","v":""},10,"",{"$f":"IFERROR(VLOOKUP($B11,'Section 2'!$A$14:$K$23,COLUMNS('Section 2'!$A$14:D$14),0),\"\")","v":""},{"$f":"IFERROR(VLOOKUP($B11,'Section 2'!$A$14:$K$23,COLUMNS('Section 2'!$A$14:E$14),0),\"\")","v":""},{"$f":"IFERROR(VLOOKUP($B11,'Section 2'!$A$14:$K$23,COLUMNS('Section 2'!$A$14:F$14),0),\"\")","v":""},{"$f":"IFERROR(VLOOKUP($B11,'Section 2'!$A$14:$K$23,COLUMNS('Section 2'!$A$14:G$14),0),\"\")","v":""},{"$f":"IFERROR(VLOOKUP($B11,'Section 2'!$A$14:$K$23,COLUMNS('Section 2'!$A$14:H$14),0),\"\")","v":""},{"$f":"IFERROR(VLOOKUP($B11,'Section 2'!$A$14:$K$23,COLUMNS('Section 2'!$A$14:I$14),0),\"\")","v":""},{"$f":"IFERROR(VLOOKUP($B11,'Section 2'!$A$14:$K$23,COLUMNS('Section 2'!$A$14:J$14),0),\"\")","v":""}]
[{"$f":"IF(D12=\"\",\"\",ROWS($A$1:A12))","v":""},1,{"$f":"IF(D12=\"\",\"\",3)","v":""},{"$f":"IFERROR(VLOOKUP($B12,'Section 3'!$A$16:$G$25,COLUMNS('Section 3'!$A$16:D$16),0),\"\")","v":""},{"$f":"IFERROR(VLOOKUP($B12,'Section 3'!$A$16:$G$25,COLUMNS('Section 3'!$A$16:E$16),0),\"\")","v":""},{"$f":"IFERROR(VLOOKUP($B12,'Section 3'!$A$16:$G$25,COLUMNS('Section 3'!$A$16:F$16),0),\"\")","v":""},{"$f":"IFERROR(PROPER(VLOOKUP($B12,'Section 3'!$A$16:$G$25,COLUMNS('Section 3'!$A$16:G$16),0)),\"\")","v":""}]
[{"$f":"IF(D13=\"\",\"\",ROWS($A$1:A13))","v":""},2,{"$f":"IF(D13=\"\",\"\",3)","v":""},{"$f":"IFERROR(VLOOKUP($B13,'Section 3'!$A$16:$G$25,COLUMNS('Section 3'!$A$16:D$16),0),\"\")","v":""},{"$f":"IFERROR(VLOOKUP($B13,'Section 3'!$A$16:$G$25,COLUMNS('Section 3'!$A$16:E$16),0),\"\")","v":""},{"$f":"IFERROR(VLOOKUP($B13,'Section 3'!$A$16:$G$25,COLUMNS('Section 3'!$A$16:F$16),0),\"\")","v":""},{"$f":"IFERROR(PROPER(VLOOKUP($B13,'Section 3'!$A$16:$G$25,COLUMNS('Section 3'!$A$16:G$16),0)),\"\")","v":""}]
[{"$f":"IF(D14=\"\",\"\",ROWS($A$1:A14))","v":""},3,"",{"$f":"IFERROR(VLOOKUP($B14,'Section 3'!$A$16:$G$25,COLUMNS('Section 3'!$A$16:D$16),0),\"\")","v":""},{"$f":"IFERROR(VLOOKUP($B14,'Section 3'!$A$16:$G$25,COLUMNS('Section 3'!$A$16:E$16),0),\"\")","v":""},{"$f":"IFERROR(VLOOKUP($B14,'Section 3'!$A$16:$G$25,COLUMNS('Section 3'!$A$16:F$16),0),\"\")","v":""},{"$f":"IFERROR(PROPER(VLOOKUP($B14,'Section 3'!$A$16:$G$25,COLUMNS('Section 3'!$A$16:G$16),0)),\"\")","v":""}]
[{"$f":"IF(D15=\"\",\"\",ROWS($A$1:A15))","v":""},4,"",{"$f":"IFERROR(VLOOKUP($B15,'Section 3'!$A$16:$G$25,COLUMNS('Section 3'!$A$16:D$16),0),\"\")","v":""},{"$f":"IFERROR(VLOOKUP($B15,'Section 3'!$A$16:$G$25,COLUMNS('Section 3'!$A$16:E$16),0),\"\")","v":""},{"$f":"IFERROR(VLOOKUP($B15,'Section 3'!$A$16:$G$25,COLUMNS('Section 3'!$A$16:F$16),0),\"\")","v":""},{"$f":"IFERROR(PROPER(VLOOKUP($B15,'Section 3'!$A$16:$G$25,COLUMNS('Section 3'!$A$16:G$16),0)),\"\")","v":""}]
{"$rows_left_out":8}
{"sheet":"TempOutput","index":9,"n_rows":510,"n_cols":9,"rows_kept":510,"hidden":true}
["MaxRow",1,"PROD2","3","2019-03-21","icf","Original Submission",2018,1]
[{"$f":"IF(OR(B2=\"\",B2=0),\"\",ROWS($A$1:A2))","v":""}]
[{"$f":"IF(OR(B3=\"\",B3=0),\"\",ROWS($A$1:A3))","v":""}]
[{"$f":"IF(OR(B4=\"\",B4=0),\"\",ROWS($A$1:A4))","v":""}]
[{"$f":"IF(OR(B5=\"\",B5=0),\"\",ROWS($A$1:A5))","v":""}]
[{"$f":"IF(OR(B6=\"\",B6=0),\"\",ROWS($A$1:A6))","v":""}]
[{"$f":"IF(OR(B7=\"\",B7=0),\"\",ROWS($A$1:A7))","v":""}]
[{"$f":"IF(OR(B8=\"\",B8=0),\"\",ROWS($A$1:A8))","v":""}]
[{"$f":"IF(OR(B9=\"\",B9=0),\"\",ROWS($A$1:A9))","v":""}]
[{"$f":"IF(OR(B10=\"\",B10=0),\"\",ROWS($A$1:A10))","v":""}]
[{"$f":"IF(OR(B11=\"\",B11=0),\"\",ROWS($A$1:A11))","v":""}]
[{"$f":"IF(OR(B12=\"\",B12=0),\"\",ROWS($A$1:A12))","v":""}]
[{"$f":"IF(OR(B13=\"\",B13=0),\"\",ROWS($A$1:A13))","v":""}]
[{"$f":"IF(OR(B14=\"\",B14=0),\"\",ROWS($A$1:A14))","v":""}]
[{"$f":"IF(OR(B15=\"\",B15=0),\"\",ROWS($A$1:A15))","v":""}]
{"$rows_left_out":495}