{"text_format":"3","workbook":"xlsx","n_sheets":10,"sheets":["Ebola Implementation Guidance","Ebola Part A - Admin Info","Ebola Part A - ETC(s)","Ebola Part A - AH(s)","Ebola Part A - Awardee HCC PMs","Ebola Part A - ETC Ebola PM","Ebola Part A - ETC OSP PM","Ebola Part A - AH Ebola PM","Ebola Part A - AH OSP PM","Ebola Part A - Impact"],"not_rendered":{"macros":1,"defined_names":8},"read":"whole","date_system":"1900"}

{"sheet":"Ebola Implementation Guidance","index":0,"n_rows":246,"n_cols":2,"rows_kept":246,"merged":[[3,0,4,0],[7,0,8,0],[10,0,12,0],[20,0,21,0],[23,0,27,0],[36,0,37,0],[38,0,39,0],[40,0,42,0],[51,0,52,0],[53,0,54,0],[64,0,65,0],[67,0,69,0],[78,0,79,0],[81,0,82,0],[91,0,92,0],[94,0,96,0],[106,0,107,0],[109,0,110,0],[119,0,120,0],[133,0,134,0],[135,0,136,0],[137,0,140,0],[152,0,155,0],[164,0,165,0],[176,0,177,0],[188,0,189,0],[191,0,194,0],[204,0,205,0],[216,0,217,0],[228,0,229,0],[231,0,232,0],[238,0,239,0],[242,0,243,0]]}
["Number",1]
["Part","A"]
["Activity","Activity A: Develop a Concept of Operations."]
["Measure","Time, in minutes, it takes from an assessment hospital’s notification to the health department of the need for an inter-facility transfer of a patient confirmed with Ebola or other special pathogen to the arrival of a staffed and equipped EMS/inter-facility transport unit, as evidenced by a no-notice exercise or real-world event."]
[null,"*Note: This measure does not apply for awardees/facilities addressing other special pathogens"]
["Reporting Element","Assessment Hospital"]
["Data Source","Coalition or Assessment Hospital Exercise or Real-World Event"]
["Metrics","Start Time: Time the health department was notified by the assessment hospital, or time from the health department’s decision, of the need for an inter-facility transfer. "]
[null,"Stop Time: Time of arrival of a staffed and equipped EMS/inter-facility transport unit."]
["Goal","Within 240 minutes or 4 hours"]
{"$rows_left_out":237}
{"sheet":"Ebola Part A - Admin Info","index":1,"n_rows":12,"n_cols":28,"rows_kept":12,"merged":[[0,0,0,5],[1,1,1,4],[2,1,2,4],[3,1,3,4],[4,1,4,4],[5,1,5,4],[6,1,6,4],[7,1,7,4],[8,1,8,4],[9,1,9,4],[10,1,10,4],[11,1,11,4]]}
["U.S. Department of Health and Human Services\nHospital Preparedness Program (HPP)\nEbola Part A End-of-Year Preparedness Measures\nAdministrative Information"]
[null,"Awardee",{"$nulls":3},"Maryland"]
[null,"Point of Contact"]
[null,"Address  "]
[null,"City/Town",{"$nulls":25},"Select"]
[null,"State/Province",{"$nulls":25},"Jurisdiction planned and exercised an Ebola scenario in Year 2"]
[null,"Zip/Postal Code",{"$nulls":25},"Jurisdiction planned and exercised an other special pathogen scenario in Year 2"]
[null,"Email Address"]
[null,"Phone Number"]
["Note: Please enter the total amount that is added together all year in Year 3.","Total Amount Allocated"]
{"$rows_left_out":3}
{"sheet":"Ebola Part A - ETC(s)","index":2,"n_rows":108,"n_cols":28,"rows_kept":108,"merged":[[0,0,0,7]]}
["U.S. Department of Health and Human Services\nHospital Preparedness Program (HPP)\nEbola Part A End-of-Year Preparedness Measures\nEbola Treatment Centers (ETCs)"]
["Facility Name*","Address","City","State","Zip code","Amount Allocated","Amount Disbursed","Status (Choose from the Dropdown List)"]
["Total Amount",{"$nulls":4},{"$f":"SUM(F4:F101)","v":{"v":0,"d":"$0.00"}},{"$f":"SUM(G4:G101)","v":{"v":0,"d":"$0.00"}}]
["University of Maryland, Medical Center","22 S Greene St","Baltimore","Maryland",21201,null,null,"Active ETC, exercising Ebola"]
["Johns Hopkins Hospital","1800 Orleans Street","Baltimore","Maryland",21287,null,null,"Active ETC, exercising OSP"]
[{"$nulls":7},"Select"]
[{"$f":"IF('Ebola Part A - AH(s)'!H4=\"AH switched to ETC in year 2, exercising Ebola\",'Ebola Part A - AH(s)'!A4,\"\")","v":""},{"$f":"IF('Ebola Part A - AH(s)'!$H4=\"AH switched to ETC In Year 2, exercising Ebola\",'Ebola Part A - AH(s)'!B4,\"\")","v":""},{"$f":"IF('Ebola Part A - AH(s)'!$H4=\"AH switched to ETC In Year 2, exercising Ebola\",'Ebola Part A - AH(s)'!C4,\"\")","v":""},{"$f":"IF('Ebola Part A - AH(s)'!$H4=\"AH switched to ETC In Year 2, exercising Ebola\",'Ebola Part A - AH(s)'!D4,\"\")","v":""},{"$f":"IF('Ebola Part A - AH(s)'!$H4=\"AH switched to ETC In Year 2, exercising Ebola\",'Ebola Part A - AH(s)'!E4,\"\")","v":""},null,null,"Select"]
[{"$f":"IF('Ebola Part A - AH(s)'!H5=\"AH switched to ETC in year 2, exercising Ebola\",'Ebola Part A - AH(s)'!A5,\"\")","v":""},{"$f":"IF('Ebola Part A - AH(s)'!$H5=\"AH switched to ETC In Year 2, exercising Ebola\",'Ebola Part A - AH(s)'!B5,\"\")","v":""},{"$f":"IF('Ebola Part A - AH(s)'!$H5=\"AH switched to ETC In Year 2, exercising Ebola\",'Ebola Part A - AH(s)'!C5,\"\")","v":""},{"$f":"IF('Ebola Part A - AH(s)'!$H5=\"AH switched to ETC In Year 2, exercising Ebola\",'Ebola Part A - AH(s)'!D5,\"\")","v":""},{"$f":"IF('Ebola Part A - AH(s)'!$H5=\"AH switched to ETC In Year 2, exercising Ebola\",'Ebola Part A - AH(s)'!E5,\"\")","v":""},null,null,"Select"]
[{"$f":"IF('Ebola Part A - AH(s)'!H6=\"AH switched to ETC in year 2, exercising Ebola\",'Ebola Part A - AH(s)'!A6,\"\")","v":""},{"$f":"IF('Ebola Part A - AH(s)'!$H6=\"AH switched to ETC In Year 2, exercising Ebola\",'Ebola Part A - AH(s)'!B6,\"\")","v":""},{"$f":"IF('Ebola Part A - AH(s)'!$H6=\"AH switched to ETC In Year 2, exercising Ebola\",'Ebola Part A - AH(s)'!C6,\"\")","v":""},{"$f":"IF('Ebola Part A - AH(s)'!$H6=\"AH switched to ETC In Year 2, exercising Ebola\",'Ebola Part A - AH(s)'!D6,\"\")","v":""},{"$f":"IF('Ebola Part A - AH(s)'!$H6=\"AH switched to ETC In Year 2, exercising Ebola\",'Ebola Part A - AH(s)'!E6,\"\")","v":""},null,null,"Select"]
[{"$f":"IF('Ebola Part A - AH(s)'!H7=\"AH switched to ETC in year 2, exercising Ebola\",'Ebola Part A - AH(s)'!A7,\"\")","v":""},{"$f":"IF('Ebola Part A - AH(s)'!$H7=\"AH switched to ETC In Year 2, exercising Ebola\",'Ebola Part A - AH(s)'!B7,\"\")","v":""},{"$f":"IF('Ebola Part A - AH(s)'!$H7=\"AH switched to ETC In Year 2, exercising Ebola\",'Ebola Part A - AH(s)'!C7,\"\")","v":""},{"$f":"IF('Ebola Part A - AH(s)'!$H7=\"AH switched to ETC In Year 2, exercising Ebola\",'Ebola Part A - AH(s)'!D7,\"\")","v":""},{"$f":"IF('Ebola Part A - AH(s)'!$H7=\"AH switched to ETC In Year 2, exercising Ebola\",'Ebola Part A - AH(s)'!E7,\"\")","v":""},null,null,"Select"]
{"$rows_left_out":12}
{"sheet":"Ebola Part A - AH(s)","index":3,"n_rows":14,"n_cols":27,"rows_kept":14,"merged":[[0,0,0,7]]}
["U.S. Department of Health and Human Services\nHospital Preparedness Program (HPP)\nEbola Part A End-of-Year Preparedness Measures\nAssessment Hospitals (AHs)",{"$nulls":25},"Select"]
["Facility Name*","Address","City","State","Zip code","Amount Allocated","Amount Disbursed","Status (Choose from the Dropdown List)",{"$nulls":18},"Active AH, exercising Ebola"]
["Total Amount",{"$nulls":4},{"$f":"SUM(F4:F127)","v":{"v":0,"d":"$0.00"}},{"$f":"SUM(G4:G127)","v":{"v":0,"d":"$0.00"}},{"$nulls":19},"Active AH, exercising OSP"]
["Anne Arundel Medical Center","5712 Warwick Pl","Chevy Chase","Maryland",20815,null,null,"Active AH, exercising Ebola",{"$nulls":18},"AH switched to ETC in Year 3, exercising Ebola"]
["Frederick Memorial Hospital","400 W 7th St","Frederick","Maryland",21701,null,null,"Active AH, exercising OSP",{"$nulls":18},"AH switched to FH in Year 3"]
["Holy Cross Hospital","1500 Forest Glen Road","Silver Spring","Maryland",20910,null,null,"Select",{"$nulls":18},"No longer a participating facility"]
["Peninsula Regional Medical Center","100 E Carroll St","Salisbury","Maryland",21801,null,null,"Select"]
["MedStar Southern Maryland Hospital Center","7503 Surratt's Road","Clinton","Maryland",20735,null,null,"Select"]
[{"$f":"IF('Ebola Part A - ETC(s)'!$H4=\"ETC switched to AH in Year 2, exercising Ebola\",'Ebola Part A - ETC(s)'!A4,\"\")","v":""},{"$f":"IF('Ebola Part A - ETC(s)'!$H4=\"ETC switched to AH in Year 2, exercising Ebola\",'Ebola Part A - ETC(s)'!B4,\"\")","v":""},{"$f":"IF('Ebola Part A - ETC(s)'!$H4=\"ETC switched to AH in Year 2, exercising Ebola\",'Ebola Part A - ETC(s)'!C4,\"\")","v":""},{"$f":"IF('Ebola Part A - ETC(s)'!$H4=\"ETC switched to AH in Year 2, exercising Ebola\",'Ebola Part A - ETC(s)'!D4,\"\")","v":""},{"$f":"IF('Ebola Part A - ETC(s)'!$H4=\"ETC switched to AH in Year 2, exercising Ebola\",'Ebola Part A - ETC(s)'!E4,\"\")","v":""},null,null,"Select"]
[{"$f":"IF('Ebola Part A - ETC(s)'!$H$5=\"ETC switched to AH in Year 2, exercising Ebola\",'Ebola Part A - ETC(s)'!A5,\"\")","v":""},{"$f":"IF('Ebola Part A - ETC(s)'!$H5=\"ETC switched to AH In Year 2, exercising Ebola\",'Ebola Part A - ETC(s)'!B5,\"\")","v":""},{"$f":"IF('Ebola Part A - ETC(s)'!$H5=\"ETC switched to AH In Year 2, exercising Ebola\",'Ebola Part A - ETC(s)'!C5,\"\")","v":""},{"$f":"IF('Ebola Part A - ETC(s)'!$H5=\"ETC switched to AH In Year 2, exercising Ebola\",'Ebola Part A - ETC(s)'!D5,\"\")","v":""},{"$f":"IF('Ebola Part A - ETC(s)'!$H5=\"ETC switched to AH In Year 2, exercising Ebola\",'Ebola Part A - ETC(s)'!E5,\"\")","v":""},null,null,"Select"]
{"$rows_left_out":5}
{"sheet":"Ebola Part A - Awardee HCC PMs","index":4,"n_rows":43,"n_cols":83,"rows_kept":43,"merged":[[1,0,1,2],[10,0,10,2],[12,0,12,2],[14,0,14,2]]}
["Performance Measure Number","U.S. Department of Health and Human Services\nHospital Preparedness Program (HPP)\nEbola Part A End-of-Year Preparedness Measures\nAwardee/Healthcare Coalition (HCC) Performance Measures","Response"]
["Activity A: Develop a Concept of Operations"]
[null,"Does the concept of operations include a signed agreement between your jurisdiction and the jurisdiction where the regional Ebola and other special pathogen treatment center is located allowing for the transfer of a patient with Ebola",{"$nulls":26},"Health Care Coalitions",{"$nulls":53},"Yes"]
[null,"Does the concept of operations include a plan for coordinating with other states within the region to identify airports that can accept air transport of Ebola patients",{"$nulls":26},"Frontline Facilities",{"$nulls":53},"No"]
[null,"Does the concept of operations include a jurisdictional-level communications strategy for notifying health care partners",{"$nulls":26},"EMS"]
[null,"Does the concept of operations include a plan for the safe intra-state transport of potential or confirmed Ebola patients",{"$nulls":26},"Assessment Hospitals"]
[null,"Does the concept of operations include a plan for the safe inter-state transport of potential or confirmed Ebola patients to a regional Ebola and other special pathogen treatment center",{"$nulls":26},"Ebola Treatment Centers"]
[null,"If \"NO\", please specify the date you will meet these requirement (MM/DD/YYYY)",{"$nulls":26},"Other (please specify)"]
[null,"Does your concept of operations identify roles and responsibilities for the following: (choose all that apply)"]
[null,"If \"Other\", please specify"]
{"$rows_left_out":34}
{"sheet":"Ebola Part A - ETC Ebola PM","index":5,"n_rows":18,"n_cols":90,"rows_kept":18,"merged":[[0,0,1,0],[0,1,1,1],[0,2,0,11],[2,0,2,1],[2,4,2,5],[2,6,2,7],[2,8,2,9],[2,10,2,11],[4,0,4,1],[12,2,12,11]]}
["Performance Measure Number","U.S. Department of Health and Human Services\nHospital Preparedness Program (HPP)\nEbola Part A End-of-Year Preparedness Measures\nEbola Treatment Centers Ebola Performance Measures"," Ebola Treatment Centers Ebola Performance Measures"]
[null,null,{"$f":"IF('Ebola Part A - ETC(s)'!H4=\"Active ETC, exercising Ebola\",'Ebola Part A - ETC(s)'!A4,\"ETC1\")","v":"University of Maryland, Medical Center"},{"$f":"IF('Ebola Part A - ETC(s)'!H5=\"Active ETC, exercising Ebola\",'Ebola Part A - ETC(s)'!A5,\"ETC2\")","v":"ETC2"},{"$f":"IF('Ebola Part A - ETC(s)'!H6=\"Active ETC, exercising Ebola\",'Ebola Part A - ETC(s)'!A6,\"ETC3\")","v":"ETC3"},{"$f":"IF('Ebola Part A - ETC(s)'!H7=\"Active ETC, exercising Ebola\",'Ebola Part A - ETC(s)'!A7,\"ETC4\")","v":"ETC4"},{"$f":"IF('Ebola Part A - ETC(s)'!H8=\"Active ETC, exercising Ebola\",'Ebola Part A - ETC(s)'!A8,\"ETC5\")","v":"ETC5"},{"$f":"IF('Ebola Part A - ETC(s)'!H9=\"Active ETC, exercising Ebola\",'Ebola Part A - ETC(s)'!A9,\"ETC6\")","v":"ETC6"},{"$f":"IF('Ebola Part A - ETC(s)'!H10=\"Active ETC, exercising Ebola\",'Ebola Part A - ETC(s)'!A10,\"ETC7\")","v":"ETC7"},{"$f":"IF('Ebola Part A - ETC(s)'!H11=\"Active ETC, exercising Ebola\",'Ebola Part A - ETC(s)'!A11,\"ETC8\")","v":"ETC8"},{"$f":"IF('Ebola Part A - ETC(s)'!H12=\"Active ETC, exercising Ebola\",'Ebola Part A - ETC(s)'!A12,\"ETC9\")","v":"ETC9"},{"$f":"IF('Ebola Part A - ETC(s)'!H13=\"Active ETC, exercising Ebola\",'Ebola Part A - ETC(s)'!A13,\"ETC10\")","v":"ETC10"}]
["Activity A: Develop a Concept of Operations"]
[1,"Time, in minutes, it takes from an assessment hospital’s notification to the health department of the need for an inter-facility transfer of a patient confirmed with Ebola or other special pathogen to the arrival of a staffed and equipped EMS/inter-facility transport unit, as evidenced by a no-notice exercise (Goal: Within 240 minutes or 4 hours) "]
["Activity B: Assure Readiness of Ebola Treatment Centers",{"$nulls":88},"Health Care Coalitions"]
[null,"Total Number of rostered/covered staff (Denominator for PM2,PM5,PM6)",{"$nulls":87},"Frontline Facilities"]
[2,"Total Number of rostered/covered staff that are trained in safely donning and doffing personal protective equipment (PPE) (Goal : 100% of rostered/covered staff)",{"$nulls":87},"EMS"]
[3,"Time, in hours, it takes for all rostered/covered staff to receive just-in-time (JIT) training, upon notification of a patient with Ebola or other special pathogen at the regional Ebola and other special pathogen treatment center (Goal : Within 72 hours)",{"$nulls":87},"Assessment Hospitals"]
[4,"Time, in hours, until an Ebola treatment center is ready to admit a patient with Ebola or other special pathogen as evidenced by an exercise or actual patient transfer (Goal: Within 72 hours)",{"$nulls":87},"Ebola Treatment Centers"]
[5,"Number of rostered/covered staff contacted by hospital within 4 hours of a patient confirmed with Ebola or other special pathogen admission to a regional Ebola and other special pathogen treatment center (Goal : 100% of rostered/covered staff)",{"$nulls":87},"Other (please specify)"]
{"$rows_left_out":9}
{"sheet":"Ebola Part A - ETC OSP PM","index":6,"n_rows":10,"n_cols":12,"rows_kept":10,"merged":[[0,0,1,0],[0,1,1,1],[0,2,0,11],[2,0,2,1],[9,2,9,11]]}
["Performance Measure Number","U.S. Department of Health and Human Services\nHospital Preparedness Program (HPP)\nEbola Part A End-of-Year Preparedness Measures\nEbola Treatment Centers Other Special Pathogens Performance Measures","Ebola Treatment Centers Other Special Pathogens Performance Measures"]
[null,null,{"$f":"IF('Ebola Part A - ETC(s)'!$H4=\"Active ETC, exercising OSP\",'Ebola Part A - ETC(s)'!A4,\"ETC1\")","v":"ETC1"},{"$f":"IF('Ebola Part A - ETC(s)'!$H5=\"Active ETC, exercising OSP\",'Ebola Part A - ETC(s)'!A5,\"ETC2\")","v":"Johns Hopkins Hospital"},{"$f":"IF('Ebola Part A - ETC(s)'!$H6=\"Active ETC, exercising OSP\",'Ebola Part A - ETC(s)'!A6,\"ETC3\")","v":"ETC3"},{"$f":"IF('Ebola Part A - ETC(s)'!$H7=\"Active ETC, exercising OSP\",'Ebola Part A - ETC(s)'!A7,\"ETC4\")","v":"ETC4"},{"$f":"IF('Ebola Part A - ETC(s)'!$H8=\"Active ETC, exercising OSP\",'Ebola Part A - ETC(s)'!A8,\"ETC5\")","v":"ETC5"},{"$f":"IF('Ebola Part A - ETC(s)'!$H9=\"Active ETC, exercising OSP\",'Ebola Part A - ETC(s)'!A9,\"ETC6\")","v":"ETC6"},{"$f":"IF('Ebola Part A - ETC(s)'!$H10=\"Active ETC, exercising OSP\",'Ebola Part A - ETC(s)'!A10,\"ETC7\")","v":"ETC7"},{"$f":"IF('Ebola Part A - ETC(s)'!$H11=\"Active ETC, exercising OSP\",'Ebola Part A - ETC(s)'!A11,\"ETC8\")","v":"ETC8"},{"$f":"IF('Ebola Part A - ETC(s)'!$H12=\"Active ETC, exercising OSP\",'Ebola Part A - ETC(s)'!A12,\"ETC9\")","v":"ETC9"},{"$f":"IF('Ebola Part A - ETC(s)'!$H13=\"Active ETC, exercising OSP\",'Ebola Part A - ETC(s)'!A13,\"ETC10\")","v":"ETC10"}]
["Activity B: Assure Readiness of Ebola Treatment Centers"]
[null,"Total Number of rostered/covered staff (Denominator for PM2,PM5,PM6)"]
[2,"Total Number of rostered/covered staff that are trained in safely donning and doffing personal protective equipment (PPE) (Goal : 100% of rostered/covered staff)"]
[3,"Time, in hours, it takes for all rostered/covered staff to receive just-in-time (JIT) training, upon notification of a patient with Ebola or other special pathogen at the regional Ebola and other special pathogen treatment center (Goal : Within 72 hours)"]
[4,"Time, in hours, until an Ebola treatment center is ready to admit a patient with Ebola or other special pathogen as evidenced by an exercise or actual patient transfer (Goal: Within 72 hours)"]
[5,"Number of rostered/covered staff contacted by hospital within 4 hours of a patient confirmed with Ebola or other special pathogen admission to a regional Ebola and other special pathogen treatment center               (Goal : 100% of rostered/covered staff)"]
[6,"Number of rostered/covered staff contacted that indicated they are able to report to fulfill Ebola or other special pathogen-related staffing needs within 72 hours (Goal :100% of contacted rostered/covered staff)"]
[null,"Comments/Additional information"]
{"$rows_left_out":1}
{"sheet":"Ebola Part A - AH Ebola PM","index":7,"n_rows":25,"n_cols":21,"rows_kept":25,"merged":[[0,0,1,0],[0,1,1,1],[0,2,0,11],[2,0,2,1],[2,4,2,5],[2,6,2,7],[2,8,2,9],[2,10,2,11],[4,0,4,1],[15,2,15,11]]}
["Performance Measure Number","U.S. Department of Health and Human Services\nHospital Preparedness Program (HPP)\nEbola Part A End-of-Year Preparedness Measures\nAssessment Hospitals Ebola Performance Measures","Assessment Hospitals Ebola Performance Measures"]
[null,null,{"$f":"IF('Ebola Part A - AH(s)'!H4=\"Active AH, exercising Ebola\",'Ebola Part A - AH(s)'!A4,\"AH1\")","v":"Anne Arundel Medical Center"},{"$f":"IF('Ebola Part A - AH(s)'!H5=\"Active AH, exercising Ebola\",'Ebola Part A - AH(s)'!A5,\"AH2\")","v":"AH2"},{"$f":"IF('Ebola Part A - AH(s)'!H6=\"Active AH, exercising Ebola\",'Ebola Part A - AH(s)'!A6,\"AH3\")","v":"AH3"},{"$f":"IF('Ebola Part A - AH(s)'!H7=\"Active AH, exercising Ebola\",'Ebola Part A - AH(s)'!A7,\"AH4\")","v":"AH4"},{"$f":"IF('Ebola Part A - AH(s)'!H8=\"Active AH, exercising Ebola\",'Ebola Part A - AH(s)'!A8,\"AH5\")","v":"AH5"},{"$f":"IF('Ebola Part A - AH(s)'!H9=\"Active AH, exercising Ebola\",'Ebola Part A - AH(s)'!A9,\"AH6\")","v":"AH6"},{"$f":"IF('Ebola Part A - AH(s)'!H10=\"Active AH, exercising Ebola\",'Ebola Part A - AH(s)'!A10,\"AH7\")","v":"AH7"},{"$f":"IF('Ebola Part A - AH(s)'!H11=\"Active AH, exercising Ebola\",'Ebola Part A - AH(s)'!A11,\"AH8\")","v":"AH8"},{"$f":"IF('Ebola Part A - AH(s)'!H12=\"Active AH, exercising Ebola\",'Ebola Part A - AH(s)'!A12,\"AH9\")","v":"AH9"},{"$f":"IF('Ebola Part A - AH(s)'!H13=\"Active AH, exercising Ebola\",'Ebola Part A - AH(s)'!A13,\"AH10\")","v":"AH10"}]
["Activity A: Develop a Concept of Operations"]
[1,"Time, in minutes, it takes from an assessment hospital’s notification to the health department of the need for an inter-facility transfer of a patient confirmed with Ebola or other special pathogen to the arrival of a staffed and equipped EMS/inter-facility transport unit, as evidenced by a no-notice exercise or real-world event (Goal: Within 240 minutes or 4 hours) "]
["Activity B: Assure Readiness of Assessment Hospitals"]
[8,"Time, in seconds, from active monitoring/direct active monitoring (AM/DAM) patient’s arrival to placement in isolation at assessment hospital (Goal: Less than or equal to 60 seconds)"]
[9,"Time, in minutes, it takes an assessment hospital to identify and isolate a patient suspected with Ebola or other special pathogen following emergency department triage, as evidenced by a real-world case or no-notice exercise (Goal: Less than or equal to 5 minutes )"]
[null,"Total number of health care facility and EMS workers in contact with an AM/DAM Ebola patient, after notification to an EMS agency or assessment hospital (Denominator for PM10,PM10(OSP),PM11)"]
[10,"Number of health care facility and emergency medical services (EMS) workers in PPE, of those make contact with an AM/DAM suspected Ebola patient under investigation (PUI) after health department notification to the assessment hospital and/or EMS Agency (Goal:100% of health care facility and EMS workers)"]
[11,"Number of health care facility and EMS workers in PPE that an AM/DAM suspected Ebola patient makes contact with after health department notification until isolation (Goal: Less than or equal to 3)"]
{"$rows_left_out":10}
{"sheet":"Ebola Part A - AH OSP PM","index":8,"n_rows":10,"n_cols":12,"rows_kept":10,"merged":[[0,0,1,0],[0,1,1,1],[0,2,0,11],[2,0,2,1],[9,2,9,11]]}
["Performance Measure Number","U.S. Department of Health and Human Services\nHospital Preparedness Program (HPP)\nEbola Part A End-of-Year Preparedness Measures\nAssessment Hospitals Other Special Pathogens Performance Measures","Assessment Hospitals Other Special Pathogens Peformance Measures"]
[null,null,{"$f":"IF('Ebola Part A - AH(s)'!$H4=\"Active AH, exercising OSP\",'Ebola Part A - AH(s)'!A4,\"AH1\")","v":"AH1"},{"$f":"IF('Ebola Part A - AH(s)'!$H5=\"Active AH, exercising OSP\",'Ebola Part A - AH(s)'!A5,\"AH2\")","v":"Frederick Memorial Hospital"},{"$f":"IF('Ebola Part A - AH(s)'!$H6=\"Active AH, exercising OSP\",'Ebola Part A - AH(s)'!A6,\"AH3\")","v":"AH3"},{"$f":"IF('Ebola Part A - AH(s)'!$H7=\"Active AH, exercising OSP\",'Ebola Part A - AH(s)'!A7,\"AH4\")","v":"AH4"},{"$f":"IF('Ebola Part A - AH(s)'!$H8=\"Active AH, exercising OSP\",'Ebola Part A - AH(s)'!A8,\"AH5\")","v":"AH5"},{"$f":"IF('Ebola Part A - AH(s)'!$H9=\"Active AH, exercising OSP\",'Ebola Part A - AH(s)'!A9,\"AH6\")","v":"AH6"},{"$f":"IF('Ebola Part A - AH(s)'!$H10=\"Active AH, exercising OSP\",'Ebola Part A - AH(s)'!A10,\"AH7\")","v":"AH7"},{"$f":"IF('Ebola Part A - AH(s)'!$H11=\"Active AH, exercising OSP\",'Ebola Part A - AH(s)'!A11,\"AH8\")","v":"AH8"},{"$f":"IF('Ebola Part A - AH(s)'!$H12=\"Active AH, exercising OSP\",'Ebola Part A - AH(s)'!A12,\"AH9\")","v":"AH9"},{"$f":"IF('Ebola Part A - AH(s)'!$H13=\"Active AH, exercising OSP\",'Ebola Part A - AH(s)'!A13,\"AH10\")","v":"AH10"}]
["Activity B: Assure Readiness of Assessment Hospitals"]
[9,"Time, in minutes, it takes an assessment hospital to identify and isolate a patient suspected with Ebola or other special pathogen following emergency department triage, as evidenced by a real-world case or no-notice exercise (Goal: Less than or equal to 5 minutes )"]
["10(OSP)","Number of health care facility and emergency medical services (EMS) workers in PPE that a patient suspected of an other special pathogen makes contact with after health department notification to the assessment hospital or EMS agency (Goal:100% of health care facility and EMS workers)"]
[null,"Total Number of emergency department staff (Denominator for PM12)"]
[12,"Number of emergency department staff trained at least annually in infection control and safety (Goal:100% of emergency department staff)"]
[null,"Total Number of intensive care unit staff (Denominator for PM13)"]
[13,"Number of intensive care unit staff trained at least annually in infection control and safety (Goal :100% of intensive care unit staff)"]
[null,"Comments/Additional information"]
{"$rows_left_out":1}
{"sheet":"Ebola Part A - Impact","index":9,"n_rows":7,"n_cols":23,"rows_kept":7,"merged":[[0,0,0,1],[0,2,0,3],[0,4,0,5],[0,6,0,7],[0,8,0,9],[0,10,0,11]]}
["U.S. Department of Health and Human Services\nHospital Preparedness Program (HPP)\nEbola Part A Preparedness Measures\nImpact"]
["Please rate your level of agreement with each of the following  statements:\n1 –Not prepared; 2 – Slightly prepared; 3 –Moderately prepared; 4 –Adequately prepared; 5 – Very  prepared","Response"]
["27a.My state/jurisdiction, including coalitions, frontline health facilities, and inter-facility transport providers, was prepared for an Ebola event in or before July 2014",{"$nulls":21},1]
["27b.My state/jurisdiction, including coalitions, frontline health facilities, and inter-facility transport providers, is prepared for an Ebola event after July 2014",{"$nulls":21},2]
["Please provide a written response in 250 words or less",{"$nulls":21},3]
["28a.Describe the impact of the Hospital Preparedness Program Ebola Preparedness and Response Activities funding on the overall preparedness of your state/jurisdiction for an Ebola or other special pathogen event. This may include capabilities developed as a result of funding or guidance from this program or other synergies you experienced.  In addition, describe any impacts that translate to all-hazards preparedness.",{"$nulls":21},4]
["28b.Describe any remaining gaps in the overall preparedness of your state/jurisdiction for an Ebola or other special pathogen event.  Note: Gaps are not limited to the existing capabilities.",{"$nulls":21},5]